program: Gaussian 09
title: 000213403
version: EM64L-G09RevD.01
frameworkgroup: C1[X(C17H21NO2)]
method: RPBEPBE
basis: SDD
operation: Freq
keyword: #p
keyword: freq=noraman
keyword: PBEPBE/SDD
title: #p freq=noraman PBEPBE/SDD
converged: YES YES NO NO
title: Mulliken charges:
elementType: O O N C C C C C C C C C C C C C C C C C H H H H H H H H H H H H H H H H H H H H H
charge: -0.257788 -0.311272 -0.094654 -0.358234 -0.327826 0.280366 0.160428 -0.614299 -0.612768 0.237011 0.319398 -0.345376 -0.336943 -0.340332 -0.248075 -0.235981 -0.388907 -0.789743 -0.239544 -0.249621 0.207578 0.235702 0.212725 0.237367 0.226547 0.193256 0.223766 0.226491 0.193224 0.224223 0.244354 0.256786 0.250666 0.225632 0.229820 0.229023 0.210554 0.238274 0.242577 0.223160 0.222434
chargesum: 0.00000
title: Mulliken charges with hydrogens summed into heavy atoms:
elementType: O O N C C C C C C C C C C C C C C C C C
charge: -0.257788 -0.311272 -0.094654 0.085046 0.122267 0.280366 0.160428 0.029270 0.031170 0.237011 0.319398 -0.101022 -0.080157 -0.089666 -0.022443 -0.006161 -0.159885 -0.098337 -0.016384 -0.027187
polarizability: 2.05625633e+02 -2.58462701e+01 2.25063444e+02 5.37393182e+00 1.00360921e+00 1.61688759e+02
1716.lowfreq: -11.4102 -8.5342 -0.0008 -0.0002 0.0003 3.9819 7.1770 20.1238 24.6276
frequency: -8.8017 19.9971 24.4636 32.6355 45.7323 72.8567 109.0803 120.6457 144.9741 152.1135 181.6583 201.5689 214.9510 219.2107 239.3628 250.9369 268.0844 303.3636 345.4089 371.2838 398.8030 410.2887 433.3506 438.7066 450.3621 501.1202 524.0077 539.3357 547.2245 558.2213 587.2500 614.1241 698.9786 712.7418 735.7284 745.9381 753.4658 764.9668 793.9956 808.1775 821.4504 843.4789 852.1795 862.4059 925.5799 930.6583 966.6356 970.6726 971.3345 984.7747 1024.3606 1034.0311 1036.1529 1042.8225 1046.6424 1058.9986 1076.5801 1090.1910 1094.1533 1110.1484 1139.9983 1163.4376 1166.1349 1170.0275 1179.2093 1194.3329 1221.7154 1240.6116 1245.4476 1264.3316 1265.4778 1281.1630 1289.2108 1332.1472 1378.1538 1380.8324 1384.3340 1400.1013 1421.0967 1427.7510 1434.6985 1444.4598 1458.4338 1461.2008 1467.9214 1475.8580 1476.7187 1477.6603 1479.3401 1481.8618 1484.9403 1492.9772 1583.1734 1594.2579 1606.7129 1611.8498 2857.8130 2866.3893 2886.5019 2981.6181 3014.2916 3020.9842 3031.1550 3042.6592 3060.8805 3078.6584 3086.2787 3089.0499 3100.5832 3120.3481 3132.0049 3134.3615 3149.6132 3149.7804 3160.4275 3164.3715 3174.1251
redmass: 2.9831 4.6648 3.6037 4.2323 3.8766 4.2975 2.4721 1.1455 2.7910 3.2773 2.8851 3.0800 1.1955 3.0605 1.3809 2.9784 4.2383 4.0797 2.4857 3.9668 3.1979 2.8119 3.6223 2.9155 2.9361 4.5668 5.5533 3.8844 4.7222 4.5018 7.0058 5.3812 4.5761 2.9665 3.4284 2.2149 1.3078 2.0510 4.0127 1.2798 4.4549 1.4650 1.3807 4.9671 1.3743 1.3694 1.3446 4.3847 1.4474 1.6052 2.5107 1.6185 2.0296 2.0115 1.5259 2.2711 1.7759 1.3071 2.5082 1.9713 1.5046 1.7311 1.2606 1.1681 1.8773 1.7824 2.7187 1.6222 2.9768 1.6812 2.1646 1.4699 1.2117 1.3697 7.9692 1.3422 5.0471 1.3331 1.1433 2.0291 2.3208 1.1622 1.0461 1.0485 1.0651 1.0802 1.3244 1.1845 2.1205 2.1422 1.0701 1.0824 6.6334 6.7021 6.6394 7.2034 1.0564 1.0589 1.0677 1.0363 1.0620 1.0736 1.0736 1.0882 1.0968 1.1012 1.1009 1.1004 1.1025 1.0862 1.0889 1.0853 1.0910 1.0919 1.0944 1.1004 1.1003
irintensity: 0.4455 0.5675 0.1705 0.5976 0.3645 0.4917 0.4041 0.3356 0.0055 0.4446 0.5379 1.8758 1.1864 2.2519 3.5784 2.5539 0.5677 1.1990 16.2960 3.2117 0.6774 4.7531 3.8063 4.9350 4.4463 1.0669 3.1358 2.0440 0.6891 1.2381 1.0862 0.9105 0.4661 4.2239 19.1047 26.4634 113.1610 45.8633 3.3367 0.3399 13.2862 0.2380 1.0490 21.8243 3.3391 1.2106 2.5828 69.5487 9.5127 2.6761 35.3796 22.2831 23.5739 14.5334 8.0590 16.0843 14.5856 8.3513 39.1478 112.3893 2.0173 5.6153 44.9177 2.3703 72.1013 73.5351 38.1050 7.1466 270.7844 3.4062 17.1024 3.1007 1.1905 6.0218 17.8972 0.7307 1.1000 15.5171 4.3928 25.0664 31.1685 1.1006 13.0193 12.4466 12.7965 20.4599 6.5695 20.3686 218.0115 45.2142 15.0082 18.0378 23.2862 23.4022 32.3706 10.2807 66.0062 127.4629 120.5980 30.7328 29.0171 39.9990 52.5558 7.6208 16.7916 23.6278 53.7963 25.7788 29.4707 8.4476 13.3636 1.5650 35.6847 9.1851 21.1510 20.3378 13.5897
temp: 298.150 k
press: 1.00000 atm
elementType: 8 8 7 6 6 6 6 6 6 6 6 6 6 6 6 6 6 6 6 6 1 1 1 1 1 1 1 1 1 1 1 1 1 1 1 1 1 1 1 1 1
symmnumber: 1
zpe: 890965.7 jmol-1
zpe.correction: 0.339351 hartree
zpe.thermalcorrener: 0.358629 hartree
zpe.thermalcorrenthalpy: 0.359573 hartree
zpe.thermalcorrgfe: 0.289821 hartree
zpe.sumelectzpe: -864.076790 hartree
zpe.sumelectthermal: -864.057512 hartree
zpe.sumelectthermalent: -864.056568 hartree
zpe.sumelectthermalfe: -864.126320 hartree
dipole: -2.8313 -0.3401 -0.3140
dipole: 2.8689
quadrupole: -111.0468 -108.5521 -118.4970
quadrupole: 0.1668 -1.1754 -1.8155
quadrupole: 1.6518 4.1466 -5.7984 0.1668 -1.1754 -1.8155
hfenergy: -864.4161412 hartree
pointgroup: C01 [X(C17H21N1O2)]
dipole: -0.3240184 1.0314068 -0.3242894 debye
polarizability: 214.3320063|28.6476089|213.347408|1.942944|-11.0617589|164.6984213 unknown
InChI: InChI=1S/C17H21NO2/c1-14-8-4-5-9-15(14)20-17-11-7-6-10-16(17)19-13-12-18(2)3/h4-11H,12-13H2,1-3H3
charge 0 multiplicity 1
41 atoms
O  -0.450329 0.558929 -0.318097
O  0.765714 -1.304902 1.304279
N  -2.172932 3.870435 -1.010973
C  -1.439467 2.844987 -0.233877
C  -1.174433 1.588549 -1.089929
C  0.934618 0.672054 -0.167899
C  1.549974 -0.339499 0.629217
C  -1.965773 5.238306 -0.490386
C  -3.609968 3.560007 -1.171021
C  0.070929 -2.300368 0.563567
C  -0.91683 -3.013639 1.295018
C  1.748026 1.679456 -0.742805
C  2.936701 -0.322904 0.860854
C  0.372063 -2.601139 -0.781309
C  3.143892 1.68341 -0.512817
C  3.743288 0.690414 0.29165
C  -1.601155 -4.050093 0.617717
C  -1.209733 -2.655288 2.736973
C  -0.330984 -3.641025 -1.429778
C  -1.320125 -4.369154 -0.732281
H  -1.978998 2.53915 0.696307
H  -0.4720 3.275186 0.081991
H  -0.630377 1.856321 -2.014828
H  -2.113565 1.084907 -1.368764
H  -0.886405 5.470197 -0.46425
H  -2.379012 5.391668 0.538507
H  -2.453616 5.966476 -1.163173
H  -4.079755 4.317781 -1.822762
H  -4.162857 3.546918 -0.197608
H  -3.744904 2.577009 -1.653448
H  1.304624 2.465209 -1.361981
H  3.364137 -1.10926 1.490816
H  1.143778 -2.034338 -1.312159
H  3.756981 2.471909 -0.962718
H  4.822237 0.699315 0.475333
H  -2.369414 -4.613353 1.161421
H  -2.037844 -3.265761 3.136058
H  -0.321076 -2.809454 3.376848
H  -1.477795 -1.587156 2.830571
H  -0.101368 -3.878733 -2.474491
H  -1.867153 -5.176726 -1.230677
