program: Gaussian 09
title: 000213380
version: EM64L-G09RevD.01
frameworkgroup: C1[X(C13H14BrNO4)]
method: RPBEPBE
basis: SDD
operation: Freq
keyword: #p
keyword: freq=noraman
keyword: PBEPBE/SDD
title: #p freq=noraman PBEPBE/SDD
converged: YES YES NO NO
title: Mulliken charges:
elementType: Br O O O O N C C C C C C C C C C C C C H H H H H H H H H H H H H H
charge: -0.003963 -0.277960 -0.301263 -0.280198 -0.281117 -0.615202 -0.077739 -0.301568 -0.320948 0.395052 -0.330449 -0.381068 -0.312234 0.293853 -0.173399 -0.154751 -0.233336 0.187235 -0.451936 0.260655 0.246167 0.253719 0.216464 0.227946 0.260708 0.253942 0.218362 0.224141 0.247794 0.249929 0.344068 0.340326 0.276770
chargesum: 0.00000
title: Mulliken charges with hydrogens summed into heavy atoms:
elementType: Br O O O O N C C C C C C C C C C C C C
charge: -0.003963 -0.277960 -0.301263 -0.280198 -0.281117 0.069192 0.182916 0.198317 0.123461 0.395052 -0.069741 -0.127127 0.130269 0.293853 0.074396 0.095178 -0.233336 0.187235 -0.175166
polarizability: 2.19250561e+02 1.27846259e+01 1.58809187e+02 -1.70959578e+00 -1.44008710e+01 1.48009107e+02
1716.lowfreq: -4.2953 -2.3305 -0.0006 0.0002 0.0004 5.4869 10.7625 26.7351 34.9829
frequency: 10.7146 26.7204 34.9658 45.1589 50.1909 54.0057 63.1843 90.7077 95.6292 127.2821 153.0878 162.3711 192.8872 222.7678 232.3052 275.8602 297.7030 305.8198 316.6451 331.9027 400.4941 414.5166 445.6015 483.0874 501.5938 507.8110 524.3409 535.5336 551.5036 622.0488 629.0001 634.5677 663.2846 679.6595 697.2916 704.7870 792.4317 805.5461 813.2459 825.0002 891.3500 909.2471 935.1606 951.0812 956.1898 965.3119 981.3897 986.5281 990.8601 1033.8454 1046.3919 1059.0435 1059.4843 1087.1308 1111.5364 1152.6468 1178.9706 1183.1781 1198.4732 1227.9254 1237.1521 1281.1995 1290.5663 1318.7580 1346.5906 1353.4546 1370.0067 1376.2083 1402.0587 1404.1179 1457.8581 1461.8369 1474.2503 1480.1744 1579.7228 1589.1127 1601.3120 1689.6594 2154.8132 2923.2928 2963.2919 2966.4375 2985.7010 3023.6918 3046.7695 3055.3815 3156.6673 3157.8645 3175.6227 3179.1086 3425.8543 3558.0655 3715.5217
redmass: 7.9106 7.1249 4.2724 4.4278 3.3825 5.8954 5.3638 6.1461 5.8731 6.6701 4.7618 7.4663 3.1507 5.3269 6.4567 4.9012 7.1921 6.2804 3.2125 3.2464 4.0807 3.0089 4.3188 3.7208 2.7139 1.1498 1.1245 4.3810 5.0102 7.1445 5.1162 1.2304 4.8071 1.2552 3.4728 10.8155 4.5252 1.5445 2.6345 1.5873 3.5112 5.5071 1.3691 2.8413 1.3974 3.8738 2.4671 4.4050 1.8978 2.8564 6.6375 2.3286 2.1241 2.0469 1.3298 1.7885 1.1974 1.1739 1.0776 3.9113 1.0953 1.5169 1.2610 1.7170 1.7034 1.9842 2.1449 1.6512 2.1794 2.1277 1.2877 1.0896 1.5161 1.1937 7.3726 1.2179 6.3575 7.4181 6.0097 1.0544 1.0561 1.1040 1.0559 1.1022 1.0891 1.1074 1.0881 1.0883 1.0965 1.0973 1.1608 1.0446 1.1059
irintensity: 0.0048 0.0053 0.5751 0.6959 9.2488 0.1793 3.9230 0.4324 6.9172 3.6366 3.6760 1.0293 16.1969 16.5607 5.7127 5.0735 1.4354 3.0549 5.8698 1.9170 6.4189 0.1175 0.4599 10.8512 22.5105 229.5976 95.0075 9.4204 13.3000 2.0157 4.4436 75.0392 25.4862 56.0736 0.2817 49.3928 24.7650 12.2336 8.4163 71.4461 15.5469 23.3022 2.4562 94.0627 5.3563 2.6708 34.1153 44.1870 4.7804 12.4994 358.2246 30.2830 8.3799 26.0396 12.9850 8.0475 54.5160 1.0798 2.1545 310.3623 28.9625 239.8385 5.2943 121.3677 141.8034 17.4870 3.0283 6.3993 3.4513 5.2067 175.4380 3.8981 88.9723 16.4287 13.2325 103.0839 30.2586 342.6121 1.6208 44.6758 51.9363 43.0088 16.6054 25.5449 25.6390 20.0548 6.1602 3.7607 9.8217 1.4359 58.8545 73.9588 53.5861
temp: 298.150 k
press: 1.00000 atm
elementType: 35 8 8 8 8 7 6 6 6 6 6 6 6 6 6 6 6 6 6 1 1 1 1 1 1 1 1 1 1 1 1 1 1
symmnumber: 1
zpe: 648550.2 jmol-1
zpe.correction: 0.247020 hartree
zpe.thermalcorrener: 0.267107 hartree
zpe.thermalcorrenthalpy: 0.268051 hartree
zpe.thermalcorrgfe: 0.193265 hartree
zpe.sumelectzpe: -871.391948 hartree
zpe.sumelectthermal: -871.371860 hartree
zpe.sumelectthermalent: -871.370916 hartree
zpe.sumelectthermalfe: -871.445703 hartree
dipole: -3.1691 -0.9105 2.9963
dipole: 4.4553
quadrupole: -126.7554 -104.2235 -113.3826
quadrupole: 4.0824 -13.3416 -8.6476
quadrupole: -11.9682 10.5637 1.4045 4.0824 -13.3416 -8.6476
hfenergy: -871.6389674 hartree
pointgroup: C01 [X(C13H14Br1N1O4)]
dipole: 1.2789858 0.0047127 1.1986242 debye
polarizability: 221.4746547|-3.9121051|155.7747359|6.2926289|13.629813|148.8194647 unknown
InChI: InChI=1S/C13H14BrNO4/c1-2-7-17-8-12(19-13(15)16)9-18-11-5-3-10(14)4-6-11/h1,3-6,12H,7-9,15H2
charge 0 multiplicity 1
33 atoms
Br -6.241546 1.599822 -0.179379
O  -0.193679 0.522008 0.449554
O  2.636743 1.274752 0.571709
O  1.835265 -2.22579 -0.144703
O  3.160082 2.398838 -1.439698
N  3.568154 3.345535 0.672244
C  2.106865 0.142727 -0.227845
C  0.686311 0.413343 -0.725007
C  2.204046 -1.076298 0.695131
C  -1.552364 0.767752 0.22056
C  -2.141031 0.887668 -1.063229
C  -2.353337 0.896347 1.383384
C  1.701691 -3.45703 0.656421
C  3.131563 2.36245 -0.184276
C  -3.529066 1.134138 -1.177524
C  -3.735456 1.14122 1.269674
C  -4.311783 1.257871 -0.014842
C  1.328656 -4.57448 -0.217844
C  1.013233 -5.538436 -0.916891
H  2.747474 0.001077 -1.118271
H  0.373593 -0.441931 -1.355668
H  0.661396 1.348994 -1.314721
H  3.241901 -1.179829 1.073609
H  1.504938 -0.966218 1.548133
H  -1.54511 0.792033 -1.974846
H  -1.879342 0.80438 2.365106
H  2.664089 -3.682684 1.167211
H  0.924854 -3.311941 1.439319
H  -3.98535 1.226533 -2.167199
H  -4.351759 1.240064 2.167749
H  3.951883 4.20005 0.278889
H  3.485873 3.226315 1.678952
H  0.738313 -6.372883 -1.5364
