program: Gaussian 09
title: 000213379
version: EM64L-G09RevD.01
frameworkgroup: C1[X(C14H16ClNO4)]
method: RPBEPBE
basis: SDD
operation: Freq
keyword: #p
keyword: freq=noraman
keyword: PBEPBE/SDD
title: #p freq=noraman PBEPBE/SDD
converged: YES YES NO NO
title: Mulliken charges:
elementType: Cl O O O O N C C C C C C C C C C C C C C H H H H H H H H H H H H H H H H
charge: -0.064742 -0.294091 -0.293817 -0.258419 -0.290774 -0.616358 -0.031004 -0.291061 -0.305859 -0.341162 0.415264 -0.383957 -0.389857 -0.202560 -0.214826 -0.320842 0.296564 -0.100961 0.188754 -0.457708 0.262623 0.194601 0.248781 0.202346 0.224769 0.209761 0.205915 0.276166 0.235058 0.253982 0.255407 0.213688 0.220492 0.340624 0.337900 0.275303
chargesum: 0.00000
title: Mulliken charges with hydrogens summed into heavy atoms:
elementType: Cl O O O O N C C C C C C C C C C C C C C
charge: -0.064742 -0.294091 -0.293817 -0.258419 -0.290774 0.062166 0.231619 0.152320 0.121256 0.074513 0.415264 -0.107791 -0.154799 0.051422 0.040581 0.113338 0.296564 -0.100961 0.188754 -0.182405
polarizability: 2.33075926e+02 9.53961414e+00 1.44052737e+02 -1.12554826e+00 1.95579882e+01 1.57556744e+02
1716.lowfreq: -4.5233 -2.6192 -0.0017 -0.0006 0.0003 3.2820 12.8216 18.9418 22.2709
frequency: 12.8080 18.8998 22.2553 30.7195 46.4338 49.6533 56.2325 74.3044 93.9487 110.9335 123.0619 140.3990 158.8080 184.6081 232.5888 243.8590 274.1039 287.6064 304.2661 318.0881 325.6023 364.3998 408.9168 433.8834 448.2680 469.4038 485.8782 498.2475 511.8470 517.3959 623.2956 625.7012 632.7231 642.6465 669.9524 676.4327 700.7696 705.5904 775.1317 803.4443 816.2109 836.9471 889.5394 907.8712 928.7714 944.4427 964.9971 969.2977 976.0357 990.2545 999.5169 1011.3787 1017.2267 1044.8375 1055.8506 1062.4299 1071.4249 1086.2871 1108.8855 1139.8788 1180.0745 1198.6637 1200.1252 1208.9307 1218.7600 1220.0358 1276.3375 1290.7804 1307.8394 1325.6554 1341.8084 1361.7659 1372.3294 1389.8976 1403.2367 1409.0590 1453.5832 1464.2391 1467.8869 1478.0588 1482.6906 1587.2798 1589.7134 1605.6526 1681.8793 2154.3206 2904.9069 2915.5629 2933.3675 2948.5185 2950.6736 2957.0671 3006.7183 3014.5295 3044.0037 3124.6704 3158.4534 3169.7194 3178.5866 3426.9856 3558.5912 3716.7430
redmass: 5.8471 4.4446 5.7690 5.9096 6.3647 4.5178 3.3554 5.1836 4.7506 3.8339 4.4948 5.6404 3.7502 6.9100 4.2095 6.2036 5.9232 4.4581 4.4203 3.2020 2.8408 5.3412 2.9158 5.3285 3.1642 3.5619 2.9991 1.1806 4.9832 1.1048 6.6909 4.8274 1.2300 5.6144 4.2165 1.3278 3.7148 9.5825 3.4314 2.3932 1.8463 1.2624 3.7694 6.9711 1.7547 1.3250 4.5845 3.6235 1.3960 1.6903 4.3223 3.5150 1.8471 7.2958 2.1921 2.7175 2.7062 3.0476 1.3715 1.7901 1.1098 1.1146 1.0622 1.2148 2.0877 1.2230 1.5001 1.2900 1.7695 1.4602 1.4087 1.7348 2.6244 3.4419 1.6350 1.6297 1.0878 1.0950 1.0775 1.9642 1.2116 1.2369 7.1480 6.1780 6.9396 6.0158 1.0569 1.0547 1.0615 1.0617 1.0998 1.1032 1.0996 1.1005 1.0860 1.0899 1.0888 1.0953 1.0969 1.1605 1.0445 1.1058
irintensity: 0.6146 0.1520 0.4128 0.2667 2.3376 2.4391 4.4080 8.5094 0.2486 3.6840 18.2155 1.2610 5.1296 5.6720 5.8979 2.9192 0.6616 1.6269 1.8127 5.8301 1.0334 5.3528 0.2533 13.2243 5.9043 4.2022 21.9589 280.2570 1.0871 48.4707 0.4340 2.9256 73.5351 12.5053 11.0720 62.2926 2.2906 43.3236 18.6336 30.1272 40.8064 8.8986 8.4275 10.9658 0.2125 2.3052 124.7677 32.5527 4.7585 7.5456 65.8383 44.4339 4.0028 265.5426 8.7092 97.7944 25.1689 55.3447 11.4157 17.2842 2.0952 13.0728 0.6684 26.8278 4.0261 6.6379 129.2788 18.6094 251.4962 56.4093 34.7858 66.3176 5.5184 2.5484 16.6279 2.0390 9.4329 13.0105 13.9181 67.9087 12.0730 95.8624 2.7912 6.3172 349.8305 0.7040 47.0878 43.6396 63.0913 52.3447 62.8143 38.8300 26.3693 27.0049 21.9593 12.0903 0.9101 5.7300 1.7366 61.0367 62.2925 51.0899
temp: 298.150 k
press: 1.00000 atm
elementType: 17 8 8 8 8 7 6 6 6 6 6 6 6 6 6 6 6 6 6 6 1 1 1 1 1 1 1 1 1 1 1 1 1 1 1 1
symmnumber: 1
zpe: 721377.5 jmol-1
zpe.correction: 0.274758 hartree
zpe.thermalcorrener: 0.296155 hartree
zpe.thermalcorrenthalpy: 0.297099 hartree
zpe.thermalcorrgfe: 0.218863 hartree
zpe.sumelectzpe: -1357.208447 hartree
zpe.sumelectthermal: -1357.187050 hartree
zpe.sumelectthermalent: -1357.186106 hartree
zpe.sumelectthermalfe: -1357.264342 hartree
dipole: 0.0464 0.0589 -0.0496
dipole: 0.0899
quadrupole: -144.0021 -123.8436 -105.4029
quadrupole: -12.4416 -16.6102 -4.4921
quadrupole: -19.5859 0.5726 19.0133 -12.4416 -16.6102 -4.4921
hfenergy: -1357.4832053 hartree
pointgroup: C01[X(C14H16Cl1N1O4)]
dipole: 0.0133214 -0.0287251 0.0157459 debye
polarizability: 227.6002311|-24.3309166|142.8938267|4.6968902|14.8637022|164.1913491 unknown
InChI: InChI=1S/C14H16ClNO4/c1-2-7-18-9-13(20-14(16)17)10-19-8-11-3-5-12(15)6-4-11/h1,3-6,13H,7-10,16H2
charge 0 multiplicity 1
36 atoms
Cl 6.4474 -2.099171 -1.12732
O  0.485381 0.361776 1.024059
O  -1.731078 1.552024 -0.635485
O  -3.493425 -0.742097 -0.016747
O  -2.384664 3.58827 0.365914
N  -2.005158 3.388539 -1.944237
C  -1.866793 0.882831 0.686006
C  -0.636074 1.138831 1.559439
C  -2.090228 -0.597326 0.392813
C  1.723568 0.589367 1.768728
C  2.868877 -0.104023 1.054229
C  2.78553 -0.410554 -0.3254
C  4.055345 -0.420987 1.760547
C  3.870275 -1.020126 -0.99556
C  5.151846 -1.024136 1.105075
C  -3.769328 -2.107596 -0.496432
C  -2.074813 2.918096 -0.652684
C  5.038947 -1.313797 -0.268262
C  -5.182656 -2.223751 -0.874356
C  -6.361313 -2.364718 -1.203658
H  -2.751204 1.306545 1.197045
H  -0.860414 0.820181 2.60257
H  -0.401958 2.222839 1.568332
H  -1.88803 -1.197096 1.306778
H  -1.398008 -0.93207 -0.405774
H  1.918371 1.685137 1.833787
H  1.625941 0.206666 2.809322
H  1.863135 -0.176531 -0.863974
H  4.133961 -0.200997 2.832388
H  3.8063 -1.260575 -2.060789
H  6.067704 -1.26814 1.650868
H  -3.532936 -2.848607 0.300462
H  -3.124105 -2.337907 -1.37353
H  -2.223283 4.365025 -2.11958
H  -1.787619 2.756894 -2.711048
H  -7.392695 -2.474016 -1.486026
