program: Gaussian 09
title: 000213394
version: EM64L-G09RevD.01
frameworkgroup: C1[X(C19H24ClNO3)]
method: RPBEPBE
basis: SDD
operation: Freq
keyword: #p
keyword: freq=noraman
keyword: PBEPBE/SDD
title: #p freq=noraman PBEPBE/SDD
converged: YES YES NO NO
title: Mulliken charges:
elementType: Cl O O O N C C C C C C C C C C C C C C C C C C C H H H H H H H H H H H H H H H H H H H H H H H H
charge: -0.068678 -0.455620 -0.291904 -0.301038 -0.127396 -0.405336 -0.092831 -0.317257 -0.323417 -0.300571 -0.676642 -0.673488 0.281331 0.142176 -0.334258 -0.333885 -0.237965 -0.229153 0.378836 -0.314980 -0.376892 -0.204084 -0.179427 -0.119224 0.212939 0.233249 0.206241 0.205449 0.193106 0.192807 0.213230 0.214160 0.239211 0.218597 0.209173 0.213101 0.221595 0.208250 0.211787 0.363770 0.255287 0.258638 0.228559 0.232908 0.259360 0.260975 0.252931 0.256378
chargesum: 0.00000
title: Mulliken charges with hydrogens summed into heavy atoms:
elementType: Cl O O O N C C C C C C C C C C C C C C C C C C C
charge: -0.068678 -0.091850 -0.291904 -0.301038 -0.127396 0.040853 0.113410 0.081299 0.082620 0.152800 -0.035771 -0.031856 0.281331 0.142176 -0.078970 -0.075247 -0.009406 0.003755 0.378836 -0.055620 -0.115917 0.048847 0.076950 -0.119224
polarizability: 2.27622492e+02 1.99439978e+01 2.87096233e+02 -1.62489652e+01 -1.27630443e+01 1.84403804e+02
1716.lowfreq: -3.3276 -0.0006 0.0002 0.0012 2.8092 5.6977 13.0741 17.2411 24.3173
frequency: 12.9955 16.8795 24.2548 33.4382 39.8828 55.6434 64.0135 67.6494 74.8988 89.4238 109.0675 121.1816 152.3545 165.6629 191.0315 203.6428 215.9478 237.6072 265.5454 269.3361 282.8240 290.5521 313.0959 323.3656 357.7940 366.2207 400.1340 415.1182 425.3770 443.0003 444.6410 456.8407 479.1566 491.7530 509.3064 513.3264 543.5105 586.3303 600.7033 621.0406 632.0594 691.7923 718.4448 746.0080 749.8000 759.3060 791.7126 796.2652 798.7501 810.4967 822.9514 843.9128 847.8797 858.6602 893.0970 926.5437 930.6278 937.2167 952.4771 970.7855 973.4869 986.1945 992.7150 1034.6023 1038.1065 1060.4787 1067.9133 1069.3255 1075.5941 1084.6839 1092.4803 1095.9901 1104.2979 1127.1801 1153.4329 1159.8183 1167.2499 1174.2995 1200.5436 1204.0099 1208.1178 1241.5349 1248.5316 1263.0057 1268.6289 1284.2526 1285.9269 1290.1963 1310.9336 1333.8221 1361.7037 1362.6175 1372.0581 1376.0872 1384.2253 1386.1473 1389.2005 1397.5112 1402.1963 1436.3668 1455.0570 1463.8163 1464.8018 1466.6443 1470.5014 1478.8496 1483.1872 1484.1510 1487.1372 1491.9520 1585.0563 1590.9082 1597.9107 1610.8236 2862.0221 2870.5636 2920.9223 2961.3332 2977.2968 2980.1089 2984.1797 3026.5406 3036.7184 3053.3042 3062.5654 3074.6949 3077.6941 3085.7769 3090.1483 3137.7926 3153.4179 3154.6242 3159.3271 3164.9137 3173.8778 3176.6981 3179.1408 3544.5385
redmass: 7.6892 4.1056 4.3597 3.7507 3.7439 3.7102 4.5822 3.8793 4.4757 2.2725 3.5604 3.9053 3.1165 5.8397 1.7637 5.2740 1.3200 4.9653 2.6370 2.4415 4.5700 2.2952 5.0456 4.4696 3.9855 2.7235 6.1183 3.0173 1.1712 2.4388 3.3125 3.2483 3.4154 2.9306 3.4303 3.1954 4.3130 5.9308 6.0454 7.0998 6.3077 3.7370 4.7076 2.7130 2.5435 1.6632 4.4715 1.2173 1.2018 1.2574 1.5635 1.5696 2.6884 3.7962 2.0276 1.5805 1.6069 1.3257 1.3442 1.3063 5.6966 2.2111 4.0728 2.1714 2.1829 2.1375 2.6197 2.1864 1.8046 2.1481 2.5035 2.2986 1.2986 1.9218 1.3948 1.6880 1.1592 1.4164 2.9555 1.7757 1.7053 1.3927 3.0928 1.3037 1.4715 1.1856 1.2521 1.2376 1.3049 1.2600 1.3832 1.3655 5.4891 1.9601 2.9037 1.2428 1.2414 1.7252 3.8706 2.3388 1.1445 1.0559 1.0589 2.3447 1.0624 1.0653 1.8002 1.2389 1.0908 1.0752 6.7847 7.5775 7.0613 6.9981 1.0721 1.0712 1.0699 1.0821 1.0562 1.0375 1.0357 1.0879 1.0877 1.0923 1.1047 1.0983 1.0983 1.1006 1.1004 1.0857 1.0899 1.0883 1.0887 1.0943 1.0968 1.1003 1.0978 1.0656
irintensity: 0.0477 0.0505 0.0485 0.4271 0.2203 0.4972 0.7565 0.9112 0.0774 0.2010 1.2101 0.9972 3.5921 2.0789 1.0382 0.0474 0.7965 1.1352 0.4121 3.5445 1.7086 1.6959 2.2216 3.1067 6.7243 6.3245 4.3490 0.0839 117.9739 8.2851 8.0621 22.8894 8.1227 27.0139 0.4133 6.1260 2.3225 2.7186 3.2111 8.5182 8.2616 1.5622 2.8133 50.7174 19.3330 64.5653 11.1473 5.8728 9.8620 1.5061 82.4625 1.6520 2.6348 14.2893 11.0089 2.8265 13.4783 0.1597 0.3357 0.2250 76.8483 33.4596 44.8834 36.4496 28.4734 11.6414 39.9760 33.7882 15.2539 2.1596 62.1195 28.4933 15.1148 10.2328 34.0734 13.7911 26.9353 19.1028 187.2249 7.5885 20.1662 94.1628 255.3585 26.8213 13.5693 6.3960 0.2165 20.8654 6.6194 3.9196 3.1999 2.5822 3.3105 3.9227 11.6875 15.3153 21.8400 12.0180 1.7347 32.8041 43.1056 8.2338 2.5267 254.0398 2.9231 2.9871 112.4542 37.1897 26.6520 13.1205 18.7177 6.3312 17.4109 28.0985 33.9428 172.4480 79.1858 25.2292 23.5698 39.4095 25.6126 13.6250 13.2020 17.6657 27.4497 52.4644 64.7629 42.3406 53.5263 1.6948 15.4017 3.8847 2.3205 15.8274 4.2037 12.0906 1.1578 9.6541
temp: 298.150 k
press: 1.00000 atm
elementType: 17 8 8 8 7 6 6 6 6 6 6 6 6 6 6 6 6 6 6 6 6 6 6 6 1 1 1 1 1 1 1 1 1 1 1 1 1 1 1 1 1 1 1 1 1 1 1 1
symmnumber: 1
zpe: 1024349.1 jmol-1
zpe.correction: 0.390154 hartree
zpe.thermalcorrener: 0.415092 hartree
zpe.thermalcorrenthalpy: 0.416036 hartree
zpe.thermalcorrgfe: 0.331322 hartree
zpe.sumelectzpe: -1477.049986 hartree
zpe.sumelectthermal: -1477.025049 hartree
zpe.sumelectthermalent: -1477.024105 hartree
zpe.sumelectthermalfe: -1477.108819 hartree
dipole: 3.0594 1.9027 -2.0411
dipole: 4.1408
quadrupole: -143.5845 -147.3919 -153.3527
quadrupole: -7.0105 -7.2310 -5.1651
quadrupole: 4.5252 0.7178 -5.2430 -7.0105 -7.2310 -5.1651
hfenergy: -1477.4401404 hartree
pointgroup: C01 [X(C19H24Cl1N1O3)]
dipole: -1.0161208 0.5284519 1.1585727 debye
polarizability: 219.4493345|-10.1844279|275.8292449|-25.5025545|35.9863795|203.8439506 unknown
InChI: InChI=1S/C19H24ClNO3/c1-3-21(4-2)13-16(22)14-23-18-7-5-6-8-19(18)24-17-11-9-15(20)10-12-17/h5-12,16,22H,3-4,13-14H2,1-2H3
charge 0 multiplicity 1
48 atoms
Cl 4.003815 -4.156663 -1.027659
O  -1.736453 -0.117889 -2.466843
O  -0.190428 0.909322 -0.345211
O  2.386737 1.655905 -1.028729
N  -3.681293 -1.602786 0.369544
C  -3.379365 -1.034831 -0.970162
C  -1.916653 -0.567432 -1.080456
C  -5.076074 -1.334333 0.816148
C  -3.310196 -3.043913 0.468434
C  -1.609333 0.565637 -0.099349
C  -5.295619 0.124423 1.260067
C  -3.009736 -3.49204 1.911159
C  0.378152 1.954346 0.384805
C  1.725492 2.286336 0.057952
C  -0.28339 2.684191 1.401349
C  2.384323 3.337219 0.718975
C  0.387764 3.735466 2.067968
C  1.71708 4.068791 1.729523
C  2.719007 0.282703 -0.956837
C  2.665509 -0.476274 0.234272
C  3.167596 -0.295302 -2.16614
C  3.058968 -1.832785 0.210593
C  3.56134 -1.649393 -2.19054
C  3.498978 -2.400804 -0.999734
H  -4.030708 -0.16302 -1.160852
H  -3.567712 -1.758974 -1.795814
H  -1.223919 -1.408384 -0.861217
H  -5.284663 -1.996316 1.675926
H  -5.817342 -1.603608 0.021989
H  -4.105086 -3.695246 0.025278
H  -2.403759 -3.201569 -0.14498
H  -2.241645 1.451702 -0.310567
H  -1.759936 0.2223 0.940674
H  -4.60661 0.378515 2.085067
H  -5.122947 0.838591 0.434343
H  -6.334345 0.26837 1.611129
H  -2.182641 -2.893877 2.332049
H  -3.886346 -3.372954 2.573154
H  -2.719497 -4.558994 1.930054
H  -0.824262 0.26681 -2.538227
H  -1.316592 2.444295 1.668468
H  3.412086 3.571566 0.425073
H  -0.137064 4.294953 2.849707
H  2.232293 4.886984 2.242162
H  2.325057 -0.021863 1.169305
H  3.204243 0.318577 -3.070562
H  3.02377 -2.433144 1.124189
H  3.908606 -2.109203 -3.120074
