program: Gaussian 09
title: 000213389
version: EM64L-G09RevD.01
frameworkgroup: C1[X(C20H25NO2)]
method: RPBEPBE
basis: SDD
operation: Freq
keyword: #p
keyword: freq=noraman
keyword: PBEPBE/SDD
title: #p freq=noraman PBEPBE/SDD
converged: YES YES NO NO
title: Mulliken charges:
elementType: O O N C C C C C C C C C C C C C C C C C C C C H H H H H H H H H H H H H H H H H H H H H H H H H
charge: -0.274056 -0.311509 -0.106368 -0.425031 -0.419683 -0.451845 -0.444969 -0.405635 0.026149 -0.741959 0.233909 0.154669 -0.349016 -0.342063 -0.261018 -0.236488 0.236998 0.318531 -0.342683 -0.389522 -0.790260 -0.243749 -0.251057 0.234373 0.216975 0.225504 0.221072 0.231864 0.221801 0.222081 0.225201 0.214121 0.258521 0.229671 0.247748 0.231435 0.199412 0.314041 0.254686 0.224215 0.226869 0.252587 0.228473 0.243169 0.238328 0.209625 0.222964 0.221920
chargesum: 0.00000
title: Mulliken charges with hydrogens summed into heavy atoms:
elementType: O O N C C C C C C C C C C C C C C C C C C C C
charge: -0.274056 -0.311509 -0.106368 0.026317 0.026893 0.001819 0.002312 0.067007 0.255821 -0.063363 0.233909 0.154669 -0.034975 -0.087377 -0.036803 -0.009619 0.236998 0.318531 -0.090096 -0.161049 -0.099138 -0.020784 -0.029137
polarizability: 2.51431206e+02 2.56969139e+01 2.46425095e+02 -9.35482131e+00 2.21081013e-01 1.84130563e+02
1716.lowfreq: -17.3685 -10.8802 -0.0005 0.0004 0.0006 0.5081 12.7834 13.8825 25.6183
frequency: 2.6699 13.5777 24.9850 32.0044 32.7339 49.0247 73.6335 80.2841 113.9662 116.1565 129.0142 150.3804 176.1062 193.5817 207.1895 222.4783 248.7493 272.2522 287.9171 304.4988 359.9423 377.4009 403.8536 422.2744 437.5870 444.5957 458.9599 503.6328 526.9685 539.3003 546.4685 569.7951 593.9779 615.2291 632.0087 637.0370 708.5201 715.4982 736.3164 747.3732 756.3150 765.4949 774.1968 792.2380 828.6743 833.1678 851.8604 855.6229 873.6262 876.9192 884.2837 897.4832 921.4295 929.4983 931.2997 943.8686 946.0941 970.9918 984.2644 985.1585 1019.7912 1031.0747 1039.9545 1043.0920 1045.5425 1055.5855 1064.8877 1089.8064 1107.5117 1112.1249 1120.0858 1143.3269 1163.0714 1166.8784 1172.3131 1174.4898 1186.6252 1192.4751 1218.2439 1221.7625 1244.7146 1245.7892 1252.6366 1280.9084 1282.4722 1289.3695 1293.7897 1299.6848 1315.7813 1321.3975 1342.4273 1357.7798 1378.0010 1384.3220 1392.8466 1398.7935 1427.4788 1433.7311 1456.1932 1456.9669 1461.8994 1464.4595 1471.9497 1473.2049 1476.6123 1478.4973 1481.7480 1488.4908 1489.2781 1581.7178 1594.3114 1607.3563 1611.0684 2895.7524 2981.4460 2983.4039 2990.1109 2991.4366 2999.1884 3004.5813 3020.0176 3047.8979 3056.5323 3060.8212 3073.4010 3078.7547 3085.2446 3089.0865 3090.3951 3092.0769 3102.9032 3119.3441 3130.7202 3134.2348 3149.1500 3151.0891 3163.5769 3169.8791
redmass: 3.7774 3.7224 3.9173 3.1813 3.4753 2.0381 3.6677 4.7090 2.5077 1.8237 1.8018 2.9790 4.1013 3.7385 3.6559 1.0956 3.3099 3.6812 3.3074 3.9833 2.7917 2.6146 2.8043 3.6951 3.2836 3.5406 2.9960 4.2091 4.1658 3.9988 4.4573 6.3791 6.5165 5.5439 2.5757 2.3457 4.4148 3.3992 2.7886 2.3835 1.3649 2.3017 1.7820 4.5341 1.6982 2.1276 2.7422 1.6737 1.4508 3.3976 2.6536 2.4895 2.9909 1.8669 1.3687 1.5957 1.3423 1.3044 1.6010 1.2734 2.8269 2.1810 2.1417 2.0256 1.5284 2.0020 2.0794 2.5790 2.0694 2.0483 2.1646 2.3261 1.4881 1.2613 1.5137 1.2727 1.6553 1.2698 1.1367 2.7149 2.4102 1.6085 1.2746 1.4677 1.3235 1.5400 1.2808 1.2574 1.2544 1.5112 1.3490 1.3658 6.4371 4.6294 1.2708 1.3742 2.0235 2.3384 1.0473 1.0462 1.0768 1.0820 1.0767 1.0745 1.3020 1.0878 2.1261 1.7996 1.3144 6.5135 6.6129 6.3821 7.0808 1.0706 1.0362 1.0844 1.0372 1.0650 1.0641 1.0602 1.0643 1.0900 1.1011 1.0968 1.1001 1.1023 1.0990 1.1004 1.0957 1.1038 1.1003 1.0862 1.0888 1.0874 1.0934 1.0925 1.1003 1.0993
irintensity: 0.2062 0.1957 0.4593 0.1292 0.2456 0.6375 1.3326 0.2664 0.7061 0.3156 0.3832 0.2290 0.2347 2.0609 1.0088 0.4695 5.0946 0.5283 1.0442 1.4439 4.6463 2.3851 0.3559 2.1548 5.4268 1.7902 14.7826 1.0163 2.7421 0.2210 3.2123 1.2096 2.5700 0.6596 0.7772 10.6677 1.4885 4.6108 18.8196 15.7080 113.2281 0.9431 58.5631 0.4230 4.5808 19.2135 19.0403 8.4458 2.3826 14.7828 8.3206 10.7136 55.6616 12.3897 2.5985 4.4575 5.9631 0.1030 2.9587 3.1828 15.9811 46.2879 11.6009 15.9399 8.5175 38.3927 5.2069 32.2516 25.7305 72.5213 44.1594 4.1058 19.3603 35.3668 29.8286 3.5728 98.6829 4.1227 3.3023 30.8187 195.1695 82.1799 12.6697 3.4313 4.5321 35.0772 5.6544 1.9179 1.2562 7.2059 3.3013 1.6132 18.6901 1.0176 26.1266 16.3693 24.8210 28.8217 10.1577 12.5891 12.0283 2.5826 6.0338 12.4623 3.0603 15.7899 131.3976 96.5018 28.0849 21.6348 23.4707 30.6438 12.2684 54.5977 31.1202 14.9943 17.7715 37.9496 39.6588 38.2773 54.7124 11.6382 16.6293 16.9795 0.4688 16.6301 41.8867 26.8037 20.1023 112.2954 24.8867 8.7000 13.7933 0.9254 32.7453 17.4963 21.0887 20.8743
temp: 298.150 k
press: 1.00000 atm
elementType: 8 8 7 6 6 6 6 6 6 6 6 6 6 6 6 6 6 6 6 6 6 6 6 1 1 1 1 1 1 1 1 1 1 1 1 1 1 1 1 1 1 1 1 1 1 1 1 1
symmnumber: 1
zpe: 1057952.2 jmol-1
zpe.correction: 0.402953 hartree
zpe.thermalcorrener: 0.425457 hartree
zpe.thermalcorrenthalpy: 0.426401 hartree
zpe.thermalcorrgfe: 0.345466 hartree
zpe.sumelectzpe: -980.578776 hartree
zpe.sumelectthermal: -980.556272 hartree
zpe.sumelectthermalent: -980.555328 hartree
zpe.sumelectthermalfe: -980.636263 hartree
dipole: 3.9485 -1.3427 -0.4644
dipole: 4.1963
quadrupole: -126.5977 -130.0664 -135.0211
quadrupole: -0.1577 -0.3870 -0.6705
quadrupole: 3.9640 0.4953 -4.4594 -0.1577 -0.3870 -0.6705
hfenergy: -980.9817289 hartree
pointgroup: C01 [X(C20H25N1O2)]
dipole: -1.6368207 0.2029859 -0.0729235 debye
polarizability: 239.5384751|0.8265354|184.3520455|-23.6709322|-11.0171765|258.096343 unknown
InChI: InChI=1S/C20H25NO2/c1-16-9-3-4-10-18(16)23-20-12-6-5-11-19(20)22-17(2)15-21-13-7-8-14-21/h3-6,9-12,17H,7-8,13-15H2,1-2H3
charge 0 multiplicity 1
48 atoms
O  0.049134 0.309659 -0.086347
O  2.749974 0.362607 0.466065
N  -3.36477 0.478928 1.048751
C  -4.054598 1.327811 2.066785
C  -4.489414 0.054943 0.156802
C  -5.143806 2.152303 1.297819
C  -5.453597 1.286921 0.030296
C  -2.272398 1.190783 0.323762
C  -1.382797 0.199848 -0.486193
C  -1.370389 0.467545 -1.993093
C  0.446203 -0.22571 1.143156
C  1.851224 -0.229698 1.38921
C  -0.431066 -0.742778 2.128718
C  2.363091 -0.717045 2.604429
C  0.095643 -1.241125 3.343952
C  1.485912 -1.226932 3.590989
C  2.952099 -0.237585 -0.805477
C  3.617535 0.580316 -1.758691
C  2.572234 -1.565536 -1.094279
C  3.887736 0.011644 -3.025504
C  4.005586 2.00161 -1.408362
C  2.855672 -2.103947 -2.369453
C  3.514611 -1.317086 -3.340174
H  -3.327115 1.953813 2.610331
H  -4.542958 0.657919 2.800171
H  -5.016624 -0.787689 0.64234
H  -4.109978 -0.3035 -0.814936
H  -4.75356 3.144611 1.009603
H  -6.040507 2.316767 1.920245
H  -6.508715 0.964206 -0.005259
H  -5.25302 1.856649 -0.89445
H  -2.652675 1.984418 -0.361658
H  -1.638531 1.692362 1.075965
H  -1.722402 -0.833498 -0.268441
H  -0.732783 -0.265961 -2.51419
H  -0.973808 1.477376 -2.199935
H  -2.395251 0.404973 -2.402866
H  -1.516518 -0.723433 1.964535
H  3.446489 -0.690561 2.758179
H  -0.592817 -1.632626 4.101136
H  1.887939 -1.606249 4.536024
H  2.067019 -2.169093 -0.333317
H  4.398807 0.625868 -3.776994
H  3.126736 2.5754 -1.062311
H  4.736577 2.024067 -0.5788
H  4.447865 2.517159 -2.278072
H  2.564553 -3.135689 -2.59681
H  3.73806 -1.730664 -4.329547
