program: Gaussian 09
title: 000213375
version: EM64L-G09RevD.01
frameworkgroup: C1[X(C9H16N4O4)]
method: RPBEPBE
basis: SDD
operation: Freq
keyword: #p
keyword: freq=noraman
keyword: PBEPBE/SDD
title: #p freq=noraman PBEPBE/SDD
converged: YES YES NO NO
title: Mulliken charges:
elementType: O O O O N N N N C C C C C C C C C H H H H H H H H H H H H H H H H
charge: -0.273282 -0.233686 -0.211900 -0.225344 -0.446576 -0.112251 -0.323198 0.129551 -0.112651 -0.450343 -0.381113 -0.479558 0.186509 0.291126 0.045277 -0.683590 -0.682351 0.249147 0.248166 0.233338 0.224685 0.203498 0.232559 0.204177 0.393940 0.237630 0.214364 0.233872 0.223699 0.219462 0.258148 0.219592 0.367104
chargesum: 0.00000
title: Mulliken charges with hydrogens summed into heavy atoms:
elementType: O O O O N N N N C C C C C C C C C
charge: -0.273282 -0.233686 -0.211900 -0.225344 -0.052636 -0.112251 0.043907 0.129551 0.136496 0.031161 0.047070 -0.042822 0.186509 0.291126 0.282907 -0.011656 0.014852
polarizability: 1.78900016e+02 8.45258962e+00 1.68880891e+02 -6.16681401e+00 -1.11770511e+00 9.38865405e+01
1716.lowfreq: -10.0100 -2.2056 -0.0006 -0.0004 0.0006 7.5478 23.6833 39.9067 49.9865
frequency: 23.6011 39.9057 49.9671 63.3825 70.9279 83.7257 114.8051 144.1350 157.4705 172.4187 189.5561 222.5353 233.1326 246.8030 261.5415 303.4435 345.2201 355.7101 369.3489 379.4126 406.7160 458.9291 504.3439 544.5375 618.8167 625.9630 646.7806 665.7418 668.8438 712.9039 729.4899 739.7840 766.7559 792.0536 851.7449 879.3613 903.3423 913.7975 921.5181 929.6399 942.4323 959.3933 1014.0413 1059.1594 1092.7375 1097.1819 1105.2581 1140.8594 1158.5935 1168.4908 1183.8155 1187.7651 1189.9531 1219.0742 1235.9802 1265.6516 1271.2972 1308.7069 1318.1198 1331.1163 1332.9082 1336.1230 1348.1540 1365.1821 1384.0384 1399.1174 1457.2457 1458.4071 1464.9885 1467.1414 1470.5575 1473.6437 1485.5138 1487.5953 1504.4463 1624.3406 1642.3198 2932.8077 2972.7044 2987.9853 2991.5894 2995.1101 3011.6668 3031.5113 3043.8130 3054.3751 3080.3564 3086.8192 3095.7393 3100.5121 3106.0585 3351.4629 3532.5574
redmass: 4.1885 5.7435 4.4187 4.9744 6.4642 5.6693 3.8977 4.5508 3.0775 3.6107 1.0440 2.1308 2.0542 2.5484 2.7872 4.4717 5.6119 3.8548 5.5803 4.3695 3.0164 2.7501 4.1201 3.0931 1.9217 2.5086 10.3094 3.7004 3.6044 3.2298 3.3433 1.5286 3.0358 2.4906 3.4402 3.2152 2.7880 3.6524 3.0680 1.2343 1.3756 4.4161 2.2789 2.3957 1.9181 1.7895 3.7107 4.1297 2.0566 2.9679 4.4999 1.7037 1.4467 1.3511 2.1049 1.2858 1.2723 1.6814 1.9077 1.6147 1.3576 1.3624 1.3759 1.2898 1.2604 1.2262 1.0578 1.1037 1.0526 2.3064 1.1424 1.0526 1.0956 1.0486 1.8103 9.7993 6.4068 1.0712 1.0808 1.0615 1.0357 1.0360 1.0640 1.0868 1.0938 1.0971 1.1028 1.0994 1.0987 1.1007 1.1008 1.0776 1.0790
irintensity: 0.0735 0.7210 0.4749 1.1213 0.0597 0.1568 2.2359 5.7887 0.4081 3.9981 0.1556 2.2218 6.0684 4.7852 22.0589 2.9012 0.5738 3.0394 4.9726 13.4991 8.6549 4.4863 7.5785 4.2460 42.1516 41.9206 9.4107 73.4924 29.8168 15.7093 14.5518 57.2706 12.9738 8.2184 11.0639 3.9678 22.5353 49.0145 4.7742 2.7110 0.0930 14.6232 14.5124 1.1417 15.4389 170.0989 13.3582 93.7012 14.8845 290.7723 422.0869 52.7346 36.7452 7.4991 39.4724 45.9541 0.8410 13.8873 61.8694 9.4303 1.1448 2.5150 1.2499 15.9401 33.5628 19.3611 12.3644 20.1590 6.4875 452.7911 30.9514 12.1316 14.7325 23.5561 145.7496 247.4220 125.8904 41.5987 34.3797 50.0867 12.6397 19.0929 12.2326 5.4876 40.8152 43.2936 30.6093 5.0130 47.5037 18.8196 27.4643 123.4100 82.5445
temp: 298.150 k
press: 1.00000 atm
elementType: 8 8 8 8 7 7 7 7 6 6 6 6 6 6 6 6 6 1 1 1 1 1 1 1 1 1 1 1 1 1 1 1 1
symmnumber: 1
zpe: 690451.8 jmol-1
zpe.correction: 0.262979 hartree
zpe.thermalcorrener: 0.280734 hartree
zpe.thermalcorrenthalpy: 0.281679 hartree
zpe.thermalcorrgfe: 0.215636 hartree
zpe.sumelectzpe: -871.028228 hartree
zpe.sumelectthermal: -871.010473 hartree
zpe.sumelectthermalent: -871.009528 hartree
zpe.sumelectthermalfe: -871.075571 hartree
dipole: 5.8946 4.1856 -0.0075
dipole: 7.2295
quadrupole: -98.2659 -111.0039 -98.3242
quadrupole: -11.0299 1.2875 -0.5196
quadrupole: 4.2654 -8.4726 4.2072 -11.0299 1.2875 -0.5196
hfenergy: -871.2912069 hartree
pointgroup: C01 [X(C9H16N4O4)]
dipole: 2.2115467 -1.7773235 0.2005335 debye
polarizability: 177.3389155|-8.3100271|169.3320315|9.3871128|-7.106054|94.9965005 unknown
InChI: InChI=1S/C9H16N4O4/c1-6(2)17-8(14)7-4-3-5-10-9(11-7)12-13(15)16/h6-7,11-12H,3-5H2,1-2H3
charge 0 multiplicity 1
33 atoms
O  2.925803 -0.152581 0.293863
O  1.522509 1.709047 0.148932
O  -4.14148 2.461995 -0.709548
O  -1.930262 2.608553 -0.090847
N  -0.705205 0.204358 0.413087
N  -2.328834 -1.598568 0.015813
N  -3.004996 0.555346 -0.211535
N  -3.015352 1.947809 -0.349544
C  0.560195 -0.559358 0.384946
C  0.593183 -1.613918 -0.759988
C  -0.188151 -2.916097 -0.421621
C  -1.429758 -2.680415 0.475363
C  1.693263 0.471334 0.249869
C  -1.925176 -0.353664 0.086132
C  4.153475 0.734853 0.189223
C  5.274882 -0.057178 0.86155
C  4.402719 1.055442 -1.289991
H  0.738637 -1.074628 1.350966
H  1.645103 -1.863814 -0.98053
H  0.171361 -1.136494 -1.663898
H  -0.499221 -3.392157 -1.370207
H  0.476314 -3.634248 0.098219
H  -2.025793 -3.608818 0.512018
H  -1.095117 -2.477987 1.516971
H  -0.622852 1.234935 0.402088
H  3.918775 1.661505 0.745349
H  6.206557 0.53666 0.853539
H  5.020732 -0.290959 1.909294
H  5.461983 -1.004372 0.325922
H  5.308818 1.680792 -1.387418
H  3.555082 1.614002 -1.720598
H  4.558435 0.128194 -1.869395
H  -3.903328 0.105334 -0.415227
