program: Gaussian 09
title: 000213378
version: EM64L-G09RevD.01
frameworkgroup: C1[X(C13H14ClNO4)]
method: RPBEPBE
basis: SDD
operation: Freq
keyword: #p
keyword: freq=noraman
keyword: PBEPBE/SDD
title: #p freq=noraman PBEPBE/SDD
converged: YES YES NO NO
title: Mulliken charges:
elementType: Cl O O O O N C C C C C C C C C C C C C H H H H H H H H H H H H H H
charge: -0.070990 -0.280749 -0.300759 -0.280529 -0.281622 -0.615055 -0.078693 -0.299684 -0.320428 0.422542 -0.388955 -0.356601 -0.312475 0.294024 -0.043903 -0.198734 -0.254196 0.187574 -0.452551 0.260722 0.253517 0.246684 0.228406 0.216647 0.275170 0.258745 0.218168 0.225408 0.230433 0.256597 0.343872 0.340852 0.276563
chargesum: 0.00000
title: Mulliken charges with hydrogens summed into heavy atoms:
elementType: Cl O O O O N C C C C C C C C C C C C C
charge: -0.070990 -0.280749 -0.300759 -0.280529 -0.281622 0.069669 0.182029 0.200517 0.124625 0.422542 -0.113785 -0.097856 0.131101 0.294024 -0.043903 0.031699 0.002401 0.187574 -0.175988
polarizability: 1.85958201e+02 -7.96394174e+00 1.58379479e+02 1.07524677e+01 1.47201834e+01 1.58993645e+02
1716.lowfreq: -7.9824 -3.4802 -0.9108 0.0018 0.0019 0.0020 13.0955 24.1230 29.3087
frequency: 13.0489 24.1145 29.2913 47.3863 51.1427 57.2517 68.5751 92.4932 99.5792 147.8801 170.2271 192.2528 200.2287 223.5968 232.6283 244.2045 277.2624 317.5136 327.4898 372.9344 404.5719 436.1427 440.0989 481.7543 506.5919 521.4934 524.7569 546.9721 563.0150 626.6318 635.1846 644.1812 677.3505 679.6791 682.4129 705.5881 768.3979 795.8893 833.1257 868.4478 870.7604 894.2221 909.6762 956.3803 961.6125 965.4103 976.6481 981.2594 991.8375 1032.1192 1046.5829 1059.2227 1062.8069 1086.0907 1092.9018 1152.3870 1177.6188 1184.2520 1201.9730 1220.2662 1235.8921 1278.3911 1280.3118 1319.7283 1347.1781 1353.9400 1369.7552 1384.0953 1403.5937 1431.3892 1453.8519 1462.5351 1468.7957 1478.0043 1577.9828 1589.0731 1605.7033 1689.6190 2154.7156 2924.0136 2963.0096 2967.2516 2986.6510 3022.3375 3045.4014 3056.5280 3143.5708 3173.5567 3180.7462 3183.7925 3426.6326 3557.5616 3715.0217
redmass: 8.1601 5.7482 6.3941 4.2037 4.1108 4.7883 5.7492 5.4708 5.9567 3.9714 5.3798 5.6266 3.6657 5.1071 5.2294 6.5025 5.0524 3.2146 3.0404 8.8944 3.9338 4.9826 3.1570 3.7149 1.1427 1.8913 1.7140 4.9914 5.1358 5.3217 1.2299 4.7869 2.2853 1.2680 6.0738 10.4561 1.3803 4.2732 4.3424 1.3933 1.5089 3.2684 5.5820 2.6063 1.4864 3.8792 5.6639 2.3490 1.9436 2.8836 6.9902 2.0409 1.9092 1.9600 1.6014 1.7978 1.1182 1.1830 1.0732 3.3451 1.0960 1.4331 1.4960 1.7328 1.6639 1.7023 1.4016 4.2332 1.5285 2.8059 1.5933 1.0898 1.4442 1.0951 7.1287 1.2167 6.6326 7.4263 6.0129 1.0544 1.0558 1.1041 1.0558 1.1022 1.0892 1.1076 1.0878 1.0922 1.0938 1.0972 1.1607 1.0446 1.1058
irintensity: 0.1364 1.1074 0.0976 1.1695 10.9439 2.2365 1.0129 1.1754 9.3574 3.1925 8.4386 1.3695 5.3740 16.2055 0.1685 5.7906 4.9950 5.4573 1.7805 8.8299 7.7038 0.6947 6.7914 8.7696 221.8527 41.7260 64.8406 6.3950 0.2638 2.5828 75.0200 2.3729 24.2742 49.3404 16.2065 38.7714 67.2490 20.3951 49.6356 21.6928 11.8047 13.7913 23.6747 154.6643 35.8199 1.2287 6.1318 24.7244 12.0099 22.2587 363.1481 11.6560 19.3103 22.1309 15.9118 4.1511 11.8563 4.6482 2.2176 166.5329 30.3028 92.8907 199.3689 125.5947 145.3995 6.0813 7.3977 12.2430 9.8292 18.8885 150.1247 3.7608 17.8221 12.5780 51.2207 106.6838 187.0079 340.5210 1.5603 43.4034 51.0483 40.5038 16.4311 25.2087 25.5270 19.3899 10.4261 7.2734 1.0602 4.2359 59.1448 72.8484 53.6145
temp: 298.150 k
press: 1.00000 atm
elementType: 17 8 8 8 8 7 6 6 6 6 6 6 6 6 6 6 6 6 6 1 1 1 1 1 1 1 1 1 1 1 1 1 1
symmnumber: 1
zpe: 649488.8 jmol-1
zpe.correction: 0.247377 hartree
zpe.thermalcorrener: 0.267262 hartree
zpe.thermalcorrenthalpy: 0.268207 hartree
zpe.thermalcorrgfe: 0.194648 hartree
zpe.sumelectzpe: -1317.993206 hartree
zpe.sumelectthermal: -1317.973320 hartree
zpe.sumelectthermalent: -1317.972376 hartree
zpe.sumelectthermalfe: -1318.045935 hartree
dipole: 1.8728 -0.8821 -1.4814
dipole: 2.5456
quadrupole: -127.3119 -101.4922 -109.3201
quadrupole: -0.2453 -17.9078 9.9904
quadrupole: -14.6038 11.2159 3.3880 -0.2453 -17.9078 9.9904
hfenergy: -1318.2405829 hartree
pointgroup: C01 [X(C13H14Cl1N1O4)]
dipole: 0.8636454 0.0730596 0.5017863 debye
polarizability: 186.5329926|0.6881437|154.2380358|-8.5263239|17.0119955|162.5602971 unknown
InChI: InChI=1S/C13H14ClNO4/c1-2-6-17-8-12(19-13(15)16)9-18-11-5-3-4-10(14)7-11/h1,3-5,7,12H,6,8-9,15H2
charge 0 multiplicity 1
33 atoms
Cl -5.019031 1.363333 2.168545
O  -0.305768 0.530551 0.265873
O  2.501565 1.255193 0.64449
O  1.734163 -2.24163 -0.125154
O  3.22771 2.365259 -1.310815
N  3.428911 3.321864 0.826524
C  2.04067 0.123685 -0.197495
C  0.674664 0.403035 -0.82497
C  2.042739 -1.090724 0.736325
C  -1.636426 0.785292 -0.081751
C  -2.523904 0.926535 1.016303
C  -2.113956 0.902496 -1.411886
C  1.519925 -3.465121 0.670569
C  3.074654 2.336113 -0.064198
C  -3.876959 1.181415 0.753432
C  -3.486575 1.160668 -1.62992
C  -4.390609 1.304122 -0.554567
C  1.229422 -4.59027 -0.224859
C  0.980138 -5.561211 -0.940789
H  2.760482 -0.026077 -1.023797
H  0.712531 1.333867 -1.421382
H  0.410284 -0.454586 -1.474014
H  1.274469 -0.966546 1.525768
H  3.042648 -1.203676 1.203803
H  -2.138915 0.837583 2.034938
H  -1.441662 0.794456 -2.266838
H  2.427953 -3.688203 1.27372
H  0.672047 -3.31065 1.373792
H  -3.858494 1.250844 -2.656135
H  -5.451513 1.503344 -0.72492
H  3.854743 4.172231 0.469158
H  3.242615 3.210253 1.820198
H  0.763581 -6.402045 -1.574646
