program: Gaussian 09
title: 000213371
version: EM64L-G09RevD.01
frameworkgroup: C1[X(C15H25NO)]
method: RPBEPBE
basis: SDD
operation: Freq
keyword: #p
keyword: freq=noraman
keyword: PBEPBE/SDD
title: #p freq=noraman PBEPBE/SDD
converged: YES YES NO NO
title: Mulliken charges:
elementType: O N C C C C C C C C C C C C C C C H H H H H H H H H H H H H H H H H H H H H H H H H
charge: -0.273891 -0.110832 -0.388307 -0.246941 -0.328233 -0.324101 -0.402179 -0.234440 -0.559384 0.504095 -0.672320 -0.671889 -0.409197 -0.408928 -0.227551 -0.227652 -0.243690 0.216909 0.212518 0.198318 0.182421 0.188729 0.207318 0.188824 0.203045 0.225339 0.225529 0.178752 0.181050 0.200606 0.201924 0.207984 0.225386 0.205918 0.211567 0.225451 0.205160 0.230632 0.230413 0.222628 0.222538 0.226480
chargesum: 0.00000
title: Mulliken charges with hydrogens summed into heavy atoms:
elementType: O N C C C C C C C C C C C C C C C
charge: -0.273891 -0.110832 0.041120 0.133799 0.067814 0.067768 0.048689 0.125363 -0.156854 0.504095 -0.033032 -0.029711 -0.178566 -0.178515 -0.004924 -0.005114 -0.017210
polarizability: 2.22794707e+02 -6.77536595e+00 1.66829395e+02 1.95975320e+01 6.68491624e+00 1.30587277e+02
1716.lowfreq: -11.5845 -6.0148 -0.0007 -0.0005 0.0005 2.6215 9.0278 19.2009 29.8835
frequency: 6.2983 18.9509 29.4825 31.2274 58.7181 62.1989 78.3130 86.0897 103.4885 120.6201 130.3808 165.0683 173.9209 219.8947 225.3057 271.5566 292.3262 310.9097 334.2439 358.9827 399.5743 403.2226 438.0287 468.1484 492.9839 528.5231 581.9432 617.7642 704.6773 744.5417 760.3002 764.0673 792.8832 794.6010 804.5776 809.5872 850.9689 861.4589 913.2445 915.2279 927.0306 974.4358 987.6100 989.9032 992.2511 1025.7970 1032.4460 1040.9718 1041.2897 1064.3557 1065.3629 1075.6469 1080.0530 1084.4344 1100.4824 1101.7873 1124.1639 1155.3513 1170.9802 1172.2741 1186.4736 1207.2584 1216.3957 1232.1555 1255.5388 1257.9770 1272.4324 1277.5913 1288.2107 1288.8295 1318.6686 1327.2146 1333.7990 1359.9406 1364.1105 1372.4020 1382.5500 1385.0626 1386.7314 1406.9289 1440.0820 1460.8888 1462.4904 1468.9788 1470.3987 1473.3355 1478.8140 1482.9838 1484.2470 1486.0663 1488.5164 1491.5193 1494.5494 1593.3414 1614.6300 2849.1690 2858.6180 2898.4694 2912.8302 2925.4906 2944.1108 2974.1949 2981.0487 2981.9117 2983.4773 3003.6311 3019.8070 3023.7650 3032.4163 3058.1148 3068.7850 3074.9069 3076.3565 3090.4382 3090.8384 3113.5118 3113.9413 3130.5276 3142.0847 3161.2175
redmass: 3.6229 3.7085 3.3407 4.1909 2.9056 3.0564 2.0084 2.0917 2.6084 2.6822 2.9146 2.4316 2.0012 1.3091 2.1481 2.1354 2.0378 2.7965 2.3389 3.0494 3.5562 2.8135 2.9153 2.9988 2.9832 3.3520 4.2738 6.3573 1.7163 2.7355 1.9606 1.1019 1.1907 1.1295 1.5369 2.1904 1.2453 1.2467 2.0266 1.4770 4.6697 1.3885 2.3138 6.2298 1.3206 2.3768 3.8594 1.9302 2.8121 1.9187 2.6487 2.0860 2.8726 2.1379 1.4314 2.8138 1.7037 1.2631 1.1132 1.2665 1.1155 2.2678 2.3387 1.6723 1.2764 1.3410 1.0958 1.1150 1.2155 1.2367 1.2833 1.2568 1.4480 1.3394 1.3650 1.3918 7.8815 1.2336 1.2343 1.4810 2.1828 1.0546 1.0540 1.0751 1.0650 1.0993 1.0738 1.0970 2.1107 1.0684 1.0829 1.0778 1.0891 6.0598 6.1895 1.0719 1.0714 1.0545 1.0701 1.0573 1.1056 1.0590 1.0903 1.0464 1.0361 1.0595 1.0877 1.1015 1.0872 1.0920 1.1046 1.0985 1.0980 1.1004 1.1004 1.0866 1.0872 1.0907 1.0958 1.1015
irintensity: 0.0141 0.1093 0.3689 0.0650 0.1734 0.2399 1.6409 0.0721 0.7320 1.5801 5.2650 0.7398 1.4789 0.1853 1.1482 0.2426 1.0838 3.4653 0.2065 1.9266 4.5909 0.0013 6.1796 10.7500 1.6992 17.9264 2.7238 0.0840 53.7493 7.4118 44.4709 2.4168 8.1374 3.8629 6.1365 4.7765 0.0219 0.1500 1.1399 3.2142 14.1324 0.0222 4.9250 0.2477 0.0557 2.2133 2.2029 30.5358 61.3847 55.5234 121.2535 39.8075 16.4202 2.9467 2.9788 11.7487 7.2243 6.8966 0.5285 2.4712 0.2126 33.4000 0.1613 21.2438 0.0665 4.9075 0.1555 0.9008 19.5745 23.8773 14.5406 0.1295 0.9064 1.9751 0.6922 17.8627 0.0986 20.8901 23.5185 3.0294 6.6253 1.5004 7.8502 4.5250 4.6235 1.0040 5.6055 16.8453 17.1987 9.8948 4.3458 13.5465 9.2284 1.3692 12.4521 36.0558 172.8323 54.3255 53.1314 100.6299 55.3825 33.4854 19.9746 65.2011 31.7261 30.7446 18.1729 8.4740 19.9190 32.9988 42.7185 41.5322 79.6401 33.1243 54.5328 10.4708 7.6218 11.1536 47.9928 24.7609
temp: 298.150 k
press: 1.00000 atm
elementType: 8 7 6 6 6 6 6 6 6 6 6 6 6 6 6 6 6 1 1 1 1 1 1 1 1 1 1 1 1 1 1 1 1 1 1 1 1 1 1 1 1 1
symmnumber: 1
zpe: 968686.3 jmol-1
zpe.correction: 0.368953 hartree
zpe.thermalcorrener: 0.388661 hartree
zpe.thermalcorrenthalpy: 0.389605 hartree
zpe.thermalcorrgfe: 0.315546 hartree
zpe.sumelectzpe: -715.187810 hartree
zpe.sumelectthermal: -715.168102 hartree
zpe.sumelectthermalent: -715.167158 hartree
zpe.sumelectthermalfe: -715.241217 hartree
dipole: 0.8090 -0.4965 0.5674
dipole: 1.1058
quadrupole: -99.6183 -99.2059 -107.1132
quadrupole: -1.3080 -0.1222 1.6325
quadrupole: 2.3608 2.7733 -5.1341 -1.3080 -0.1222 1.6325
hfenergy: -715.5567635 hartree
pointgroup: C01 [X(C15H25N1O1)]
dipole: -0.3176483 0.2400776 0.1753157 debye
polarizability: 222.7774203|-11.0538716|162.4345693|-17.5553197|-13.6294018|134.9993889 unknown
InChI: InChI=1S/C15H25NO/c1-3-16(4-2)12-14-17-13-8-11-15-9-6-5-7-10-15/h5-7,9-10H,3-4,8,11-14H2,1-2H3
charge 0 multiplicity 1
42 atoms
O  -1.038022 -0.020382 -0.135265
N  -4.781562 -0.033019 -0.252484
C  -3.381666 -0.362714 -0.624889
C  -2.389486 0.277094 0.356544
C  -5.248015 1.241745 -0.861023
C  -5.729222 -1.161521 -0.445784
C  1.36512 0.117465 0.142441
C  0.010286 0.485354 0.755161
C  2.552751 0.594538 1.024434
C  3.900829 0.246405 0.409649
C  -6.365482 1.926789 -0.050826
C  -5.583706 -2.253422 0.631528
C  4.528952 -0.995438 0.686968
C  4.539379 1.138047 -0.490752
C  5.758146 -1.339781 0.08033
C  5.768412 0.799193 -1.100427
C  6.382625 -0.44298 -0.817443
H  -3.235623 -1.456752 -0.597162
H  -3.128673 -0.035306 -1.66021
H  -2.541468 -0.14411 1.373696
H  -2.542495 1.378371 0.414628
H  -5.586147 1.08971 -1.918125
H  -4.379964 1.92591 -0.909563
H  -5.622801 -1.617545 -1.46318
H  -6.754989 -0.753158 -0.392813
H  1.414054 -0.979129 0.006687
H  1.440841 0.567116 -0.865265
H  -0.083568 1.590874 0.867041
H  -0.099568 0.032744 1.768231
H  2.474366 1.690666 1.167923
H  2.462661 0.132241 2.027523
H  -7.274124 1.30099 0.011377
H  -6.020157 2.126233 0.978633
H  -6.652178 2.885387 -0.522715
H  -4.574727 -2.704447 0.624538
H  -5.7563 -1.822437 1.633156
H  -6.315079 -3.065901 0.461903
H  4.051925 -1.694927 1.385326
H  4.070318 2.105176 -0.712462
H  6.229466 -2.302555 0.309344
H  6.24792 1.50238 -1.791188
H  7.336774 -0.707002 -1.287286
