program: Gaussian 09
title: 000213377
version: EM64L-G09RevD.01
frameworkgroup: C1[X(C13H14ClNO4)]
method: RPBEPBE
basis: SDD
operation: Freq
keyword: #p
keyword: freq=noraman
keyword: PBEPBE/SDD
title: #p freq=noraman PBEPBE/SDD
converged: YES YES NO NO
title: Mulliken charges:
elementType: Cl O O O O N C C C C C C C C C C C C C H H H H H H H H H H H H H H
charge: -0.036499 -0.248651 -0.308314 -0.256168 -0.283241 -0.615514 -0.020230 -0.318376 -0.386264 0.499864 -0.325175 -0.331469 -0.366281 0.296940 -0.208982 -0.237202 -0.243769 0.247119 -0.488513 0.269785 0.221117 0.258631 0.234969 0.235918 0.260585 0.243249 0.224508 0.254041 0.228968 0.233079 0.341886 0.343182 0.280805
chargesum: 0.00000
title: Mulliken charges with hydrogens summed into heavy atoms:
elementType: Cl O O O O N C C C C C C C C C C C C C
charge: -0.036499 -0.248651 -0.308314 -0.256168 -0.283241 0.069555 0.249554 0.161372 0.084623 0.499864 -0.325175 -0.070884 0.101476 0.296940 0.045059 -0.008234 -0.010689 0.247119 -0.207708
polarizability: 1.83274281e+02 1.61159083e+01 1.78202550e+02 -2.00162177e+01 -6.65326078e+00 1.28294505e+02
1716.lowfreq: -4.6087 -0.0024 -0.0010 0.0009 2.8693 4.8972 20.0087 22.4668 30.7727
frequency: 19.9575 22.4474 30.7471 35.0641 49.8808 62.3277 75.0767 95.3872 119.1138 145.2120 155.1837 186.4007 206.8196 236.6706 258.5078 265.9126 301.2436 302.6794 370.3535 392.6428 433.2071 442.5286 448.4462 487.1799 505.6192 513.2775 529.3334 540.7756 576.6641 625.1859 626.8206 651.0334 675.0828 676.9772 702.1654 710.4132 750.6198 761.5457 798.1687 810.9330 841.6759 913.0004 924.4038 929.6786 952.0114 960.7075 969.6543 984.6579 1006.1349 1023.0140 1042.8541 1053.3426 1061.4325 1082.2292 1131.0794 1136.5063 1172.3371 1215.6392 1233.2477 1237.1888 1254.3119 1268.0627 1287.0344 1301.5884 1343.6723 1353.2109 1361.9635 1374.5315 1397.4555 1428.1599 1440.7337 1448.4919 1457.1796 1473.8945 1574.5721 1588.5696 1604.6336 1687.6316 2137.2063 2978.5673 2983.5660 2984.4757 3030.3107 3043.2708 3061.6826 3070.8185 3138.1683 3153.8891 3166.5369 3177.1487 3423.5651 3554.9747 3713.2341
redmass: 7.9071 6.4489 6.9457 5.5565 5.3746 3.9758 6.3890 4.6363 7.8610 4.3237 4.6999 6.8983 5.4326 3.6127 6.7489 6.1777 2.8932 4.0354 6.8115 2.5148 3.3912 3.2483 4.0355 3.7005 1.1602 5.5314 1.1172 3.8551 7.2010 1.2566 4.7883 4.4846 4.5594 1.3793 10.6510 3.5736 1.3392 3.5163 4.9316 4.1789 1.4303 3.8736 1.4456 1.6295 4.5928 3.4623 1.3258 4.5596 2.7181 7.2189 2.0644 2.7555 2.2458 2.6842 1.5414 1.9271 1.0668 1.1554 2.3969 1.3365 1.1699 1.5036 1.4992 1.7031 1.2115 1.5804 1.3886 4.0639 1.7244 2.3439 1.0820 1.1063 1.2004 2.0379 6.2522 1.2183 7.0677 7.3637 6.0064 1.0573 1.0585 1.0624 1.0854 1.1038 1.1034 1.1015 1.0857 1.0901 1.0940 1.1003 1.1592 1.0447 1.1057
irintensity: 0.6214 0.5115 0.3004 0.4356 5.9514 1.2076 3.0375 5.1277 1.5854 3.1962 3.1318 7.2150 2.5038 7.9571 5.8667 1.6967 9.5172 1.2026 6.3068 2.6986 6.7500 6.7209 6.5234 5.3494 177.5531 24.3154 112.5611 0.9039 9.3240 68.1572 13.9882 6.7631 24.4883 69.9789 36.9828 0.5546 96.5737 21.0751 7.8821 18.3589 1.5817 34.8472 1.7775 1.9450 61.9821 115.3997 3.0260 43.4318 24.4987 79.2102 38.8582 42.5118 30.8075 59.8642 7.7698 22.2542 4.0538 29.5745 180.2423 30.2067 8.9904 54.5372 105.9897 222.0420 14.2698 44.9389 39.9933 13.7231 15.5530 21.2061 7.2404 66.9767 31.4780 67.9365 12.6154 98.6132 44.1876 344.1503 0.2358 39.0820 22.2801 37.8484 4.9105 16.0630 4.6797 30.3832 2.5754 12.0607 14.9934 10.1276 51.3641 60.7702 52.3877
temp: 298.150 k
press: 1.00000 atm
elementType: 17 8 8 8 8 7 6 6 6 6 6 6 6 6 6 6 6 6 6 1 1 1 1 1 1 1 1 1 1 1 1 1 1
symmnumber: 1
zpe: 650358.9 jmol-1
zpe.correction: 0.247709 hartree
zpe.thermalcorrener: 0.267399 hartree
zpe.thermalcorrenthalpy: 0.268343 hartree
zpe.thermalcorrgfe: 0.195861 hartree
zpe.sumelectzpe: -1317.988900 hartree
zpe.sumelectthermal: -1317.969210 hartree
zpe.sumelectthermalent: -1317.968266 hartree
zpe.sumelectthermalfe: -1318.040747 hartree
dipole: 1.1726 -2.4324 2.7045
dipole: 3.8218
quadrupole: -105.9185 -120.4820 -109.1173
quadrupole: 7.0134 4.8979 6.4162
quadrupole: 5.9208 -8.6427 2.7219 7.0134 4.8979 6.4162
hfenergy: -1318.2366086 hartree
pointgroup: C01 [X(C13H14Cl1N1O4)]
dipole: -0.3094372 0.8386084 1.2090386 debye
polarizability: 183.424843|4.8999177|167.0291465|32.4091186|7.513768|139.3173459 unknown
InChI: InChI=1S/C13H14ClNO4/c1-2-7-17-8-10(19-13(15)16)9-18-12-6-4-3-5-11(12)14/h1,3-6,10H,7-9,15H2
charge 0 multiplicity 1
33 atoms
Cl 2.047433 -3.503531 -0.197412
O  0.861769 -0.804611 -0.48878
O  -2.017476 -0.484774 0.024422
O  -1.958288 2.491314 -1.044504
O  -3.301746 -1.844682 -1.419007
N  -3.492352 -1.958011 0.922265
C  -1.281243 0.049275 -1.153252
C  0.102023 0.445952 -0.652302
C  -2.050126 1.223751 -1.782543
C  2.138209 -0.716047 0.064986
C  2.840271 -1.934904 0.265113
C  2.775982 0.497666 0.431987
C  -2.815742 2.599811 0.158239
C  -2.976227 -1.482278 -0.260714
C  4.133284 -1.95476 0.812969
C  4.076431 0.480935 0.983955
C  4.759675 -0.738627 1.177273
C  -2.063677 2.46481 1.419415
C  -1.445706 2.397958 2.484554
H  -1.203451 -0.759448 -1.904962
H  0.600051 1.100181 -1.395558
H  0.020722 0.983958 0.309272
H  -3.106342 0.923025 -1.934211
H  -1.606614 1.457836 -2.766819
H  2.264028 1.453212 0.287449
H  -3.264119 3.609634 0.109352
H  -3.629095 1.848126 0.122177
H  4.642713 -2.913003 0.952266
H  4.552469 1.427777 1.260343
H  5.767432 -0.753434 1.603641
H  -4.194114 -2.691851 0.888156
H  -3.111428 -1.641456 1.811037
H  -0.905246 2.330194 3.411394
