program: Gaussian 09
title: 000213358
version: EM64L-G09RevD.01
frameworkgroup: C1[X(C10H13N3O3)]
method: RPBEPBE
basis: SDD
operation: Freq
keyword: #p
keyword: freq=noraman
keyword: PBEPBE/SDD
title: #p freq=noraman PBEPBE/SDD
converged: YES YES NO NO
title: Mulliken charges:
elementType: O O O N N N C C C C C C C C C C H H H H H H H H H H H H H
charge: -0.267310 -0.398214 -0.384653 -0.442357 -0.240082 -0.021350 0.432655 -0.440163 -0.316326 0.318149 -0.053603 -0.330517 -0.361763 0.278643 -0.741028 -0.537985 0.315469 0.235409 0.255262 0.241414 0.251436 0.264071 0.262679 0.256878 0.365004 0.220124 0.245352 0.218478 0.374329
chargesum: 0.00000
title: Mulliken charges with hydrogens summed into heavy atoms:
elementType: O O O N N N C C C C C C C C C C
charge: -0.267310 -0.023885 -0.019649 -0.126888 -0.240082 -0.021350 0.432655 -0.204753 -0.061065 0.318149 -0.053603 -0.089102 -0.110328 0.278643 0.042599 0.145969
polarizability: 2.47847399e+02 -5.37224157e+00 1.32211562e+02 -1.80303328e+01 -8.98068841e+00 1.01313231e+02
1716.lowfreq: -8.0933 0.0004 0.0005 0.0009 1.8668 5.9746 33.6824 46.9286 52.2732
frequency: 33.5503 46.9136 52.2550 68.4302 88.4737 102.5471 152.2135 187.9536 211.2767 234.8259 247.7407 271.4681 307.9171 325.0842 343.8782 366.8026 387.4897 400.4236 414.0702 439.0262 489.5773 491.8384 514.7679 539.3283 566.9635 615.1486 631.4036 706.5398 727.2576 743.3091 773.0261 802.7919 825.1407 829.4177 843.7559 904.9863 923.3640 951.6871 988.4526 990.3935 999.2083 1007.6315 1038.3090 1112.7406 1114.3843 1157.1923 1175.2162 1181.0875 1221.7849 1256.1363 1292.2595 1298.0568 1338.1462 1381.7518 1385.3890 1396.1854 1425.8730 1436.8693 1453.9144 1456.6278 1467.2798 1473.7423 1481.4374 1503.6852 1552.3116 1583.1641 1587.7403 1630.4329 2613.3946 2955.4681 3001.9398 3041.4280 3083.8067 3123.6768 3128.0853 3134.2437 3141.2897 3162.3326 3168.4482 3518.0459 3560.1332
redmass: 4.0131 4.9437 3.5194 1.2672 3.2276 3.7426 4.5095 4.7193 6.5930 2.0085 1.8403 6.7985 3.8569 3.0146 4.9840 2.7570 1.5992 3.3865 3.0336 3.6046 3.3239 2.1302 2.6664 4.3204 5.0950 4.5697 6.5903 3.9088 5.6478 4.3574 3.7221 1.3941 1.5021 1.2633 3.5839 6.5793 1.3967 1.3399 7.3980 7.8222 2.7855 1.7370 1.5443 1.2659 1.3293 1.3301 1.4340 2.5681 2.5623 2.4316 1.5145 1.5099 3.1991 4.4374 3.1637 1.5332 3.6432 1.1741 1.0806 1.1806 1.0503 1.0918 1.6762 2.5863 2.5690 1.5865 4.7830 6.5274 1.0684 1.0332 1.0379 1.1038 1.0956 1.0986 1.0895 1.1001 1.0883 1.0941 1.0961 1.0749 1.0674
irintensity: 2.5668 2.2552 0.7087 0.9660 5.4850 0.7079 3.5956 4.1833 1.0064 0.7379 1.2219 0.7839 6.3132 9.2285 1.5993 54.2896 38.7667 43.3663 1.2919 17.9332 39.2467 58.1556 19.7662 9.9645 102.7359 17.2202 1.6736 3.5850 24.7210 5.8843 4.7709 19.3872 45.8473 148.7559 17.5964 81.4814 4.1425 0.7283 20.2376 175.3078 93.7759 61.5371 7.5140 1.3048 11.8682 0.8005 48.6788 11.7651 251.6484 36.0930 33.9904 10.0711 21.2641 71.5606 52.8510 48.2783 4.4149 18.0795 21.4945 51.0759 13.4794 86.3221 2.5772 323.2434 25.3970 31.5385 15.2082 0.9678 170.2646 84.6978 3.2189 51.9844 8.9708 31.8745 7.6001 2.5537 12.3331 16.1868 2.6056 28.6229 81.7585
temp: 298.150 k
press: 1.00000 atm
elementType: 8 8 8 7 7 7 6 6 6 6 6 6 6 6 6 6 1 1 1 1 1 1 1 1 1 1 1 1 1
symmnumber: 1
zpe: 583672.0 jmol-1
zpe.correction: 0.222309 hartree
zpe.thermalcorrener: 0.238499 hartree
zpe.thermalcorrenthalpy: 0.239443 hartree
zpe.thermalcorrgfe: 0.177866 hartree
zpe.sumelectzpe: -777.473093 hartree
zpe.sumelectthermal: -777.456903 hartree
zpe.sumelectthermalent: -777.455959 hartree
zpe.sumelectthermalfe: -777.517536 hartree
dipole: -2.4038 2.5741 2.6450
dipole: 4.4046
quadrupole: -77.3077 -97.7204 -94.2627
quadrupole: 19.8791 -3.4862 -8.2675
quadrupole: 12.4559 -7.9568 -4.4991 19.8791 -3.4862 -8.2675
hfenergy: -777.6954022 hartree
pointgroup: C01 [X(C10H13N3O3)]
dipole: -0.7572065 -1.4522189 0.566245 debye
polarizability: 240.8798656|36.5535475|106.423588|-0.026862|-4.7944233|134.0687394 unknown
InChI: InChI=1S/C10H13N3O3/c1-7(12-14)10(13-15)11-8-3-5-9(16-2)6-4-8/h3-6,11,14-15H,1-2H3
charge 0 multiplicity 1
29 atoms
O  -4.114922 -0.259497 1.030977
O  4.243448 -0.524703 1.849914
O  3.969925 1.860749 -1.191024
N  0.914697 -0.047026 -1.589209
N  3.73577 0.246614 0.727053
N  2.696999 1.438555 -1.652693
C  -0.352174 -0.091128 -0.933565
C  -1.430462 -0.761077 -1.564387
C  -0.571108 0.510921 0.336546
C  -2.901228 -0.243966 0.320567
C  2.104622 0.426965 -0.984189
C  -2.701599 -0.829297 -0.954832
C  -1.828177 0.424297 0.959901
C  2.642776 -0.299814 0.19241
C  2.047145 -1.596363 0.680134
C  -5.257449 -0.91338 0.39201
H  0.890382 0.101744 -2.601908
H  -1.2731 -1.237912 -2.539158
H  0.232417 1.076471 0.820165
H  -3.513802 -1.345888 -1.474872
H  -2.006682 0.889078 1.934381
H  1.407247 -2.037575 -0.097047
H  1.432845 -1.433345 1.584308
H  2.853784 -2.295811 0.957248
H  4.176999 1.366011 -0.293096
H  -5.51738 -0.42483 -0.567815
H  -6.089403 -0.798961 1.102345
H  -5.062313 -1.990106 0.218151
H  5.058542 -0.024927 2.116087
