program: Gaussian 09
title: 000213343
version: EM64L-G09RevD.01
frameworkgroup: C1[X(C14H27NO2)]
method: RPBEPBE
basis: SDD
operation: Freq
keyword: #p
keyword: freq=noraman
keyword: PBEPBE/SDD
title: #p freq=noraman PBEPBE/SDD
converged: YES YES NO NO
title: Mulliken charges:
elementType: O O N C C C C C C C C C C C C C C H H H H H H H H H H H H H H H H H H H H H H H H H H H
charge: -0.264384 -0.254843 -0.110541 -0.027430 -0.206617 -0.428111 -0.441082 -0.397357 -0.397569 -0.749977 0.208815 -0.319006 -0.363820 -0.326434 -0.336466 -0.671791 -0.670788 0.198638 0.241576 0.237375 0.187088 0.205250 0.209939 0.200276 0.183612 0.194347 0.234976 0.213688 0.214353 0.222314 0.239548 0.230450 0.228642 0.215057 0.206589 0.189808 0.229353 0.190200 0.207033 0.227732 0.209240 0.208963 0.225666 0.205689
chargesum: 0.00000
title: Mulliken charges with hydrogens summed into heavy atoms:
elementType: O O N C C C C C C C C C C C C C C
charge: -0.264384 -0.254843 -0.110541 0.171209 0.034959 -0.003648 -0.025894 -0.013469 0.031753 -0.099621 0.208815 0.150992 0.079878 0.069963 0.083087 -0.027785 -0.030471
polarizability: 1.97464821e+02 -5.69207785e+00 1.53756800e+02 -1.64221336e+00 1.61395203e+00 1.43476962e+02
1716.lowfreq: -5.4313 -0.0008 -0.0007 0.0002 5.2054 11.1816 17.0379 26.1164 30.2300
frequency: 12.9148 25.9173 30.0984 46.9168 66.9825 80.2589 88.6820 106.3054 158.0385 165.9587 172.6521 201.0865 220.0172 227.1267 239.2241 268.0050 277.7025 293.8171 315.0059 325.8370 340.2837 388.0645 397.6500 411.3394 441.2148 448.5736 482.5015 524.0522 547.7843 689.2721 716.4819 743.1431 763.8991 779.9801 795.8140 797.0789 811.4208 843.7847 846.1512 867.7341 899.4352 913.4746 929.2790 968.4712 974.1106 990.9315 996.3175 1045.3961 1053.9740 1068.2123 1076.3807 1077.7332 1085.6714 1089.0326 1091.1278 1104.4535 1113.1805 1123.8498 1127.1114 1139.2846 1183.1766 1208.2095 1222.5209 1241.3824 1247.5061 1249.3882 1281.3261 1282.5326 1289.3370 1296.3871 1301.9031 1311.4325 1325.1435 1332.2239 1342.8417 1350.4176 1357.4955 1363.7214 1368.5993 1375.9629 1384.8253 1387.5709 1388.0651 1388.9243 1446.4437 1460.3863 1463.1552 1463.6510 1464.7377 1468.6146 1472.2798 1473.3327 1474.2830 1480.0490 1481.3642 1483.6820 1487.5172 1491.7150 1622.8705 2856.3328 2866.0604 2907.3144 2944.1203 2958.2176 2968.4533 2969.4371 2979.9341 2981.0156 2982.3023 2987.2210 3025.1752 3025.9198 3028.4506 3030.7393 3034.8676 3035.9014 3042.7240 3052.8021 3053.3263 3063.4448 3067.7999 3073.2915 3075.3530 3089.8479 3090.7093 3124.5201
redmass: 3.7775 3.8014 3.8005 4.2446 2.9538 2.6359 2.0971 2.8038 3.5094 2.4378 2.1422 1.7469 1.0801 1.5611 2.0083 1.7748 2.5193 2.1001 2.2015 3.1692 2.1643 3.2670 3.2587 3.3470 2.5507 2.8847 2.8761 2.1418 3.2389 3.1607 5.4182 2.6413 2.6758 1.5249 1.1923 1.2201 1.4649 2.7668 1.9823 2.6363 1.5177 2.0409 2.9272 1.5454 2.8325 2.2356 1.4316 1.9669 2.9746 1.8194 2.4560 2.1365 2.1671 2.3464 1.6749 2.0663 1.6481 1.9469 1.7388 1.8811 1.7571 2.2559 1.5829 1.4334 1.2633 1.4335 1.2386 1.1981 1.1825 1.2057 1.3238 1.3721 1.2903 1.3666 1.4978 1.4117 1.5002 1.3273 1.3310 1.3883 1.3496 1.2550 1.2401 1.2956 1.0944 1.0850 1.0576 1.0843 1.0538 1.0821 1.0524 1.0532 1.0899 1.0490 1.0569 1.0679 1.0738 1.0777 7.9941 1.0720 1.0712 1.0701 1.0829 1.0637 1.0362 1.0612 1.0616 1.0357 1.0356 1.0630 1.0931 1.0886 1.0907 1.0964 1.0871 1.0617 1.1018 1.0890 1.1018 1.0994 1.0992 1.0983 1.0981 1.1004 1.1003 1.1074
irintensity: 0.3239 0.2610 0.9104 0.4399 0.2176 0.1523 0.2463 0.4339 2.0325 0.7425 1.5792 0.3213 0.1556 0.5858 1.3830 1.2863 6.3721 1.2127 1.4964 10.1219 0.7863 5.4189 5.0470 2.1105 2.4129 12.0266 5.3267 0.2524 2.6778 8.8253 7.4176 4.2729 3.5417 4.4695 4.9138 8.3361 0.1427 1.3229 8.9219 6.1548 5.5508 1.1964 25.7599 7.4349 56.5651 6.4148 18.9327 2.3378 12.8232 35.2916 29.4099 131.2932 3.4954 28.8317 51.0882 136.6798 42.4122 9.5705 4.8397 5.6816 7.4068 33.9729 3.1208 26.7875 1.6187 25.5627 6.7712 1.7783 16.9322 14.8893 0.3540 16.0088 4.7667 5.4295 4.7917 0.7774 3.8407 4.4733 2.4695 7.5092 17.2965 18.1797 19.0823 15.5225 10.2154 4.2911 4.3102 6.7734 5.0167 14.1648 4.3401 18.0980 13.4037 2.3980 15.6865 11.3769 11.0973 10.8739 102.5066 43.6379 138.0002 87.0669 25.8317 46.9266 27.7180 30.1201 55.7281 33.3098 29.7122 38.4663 79.8969 7.2280 6.7475 29.8700 19.3681 25.5390 6.6565 19.9070 57.7700 59.4543 51.7152 39.9194 74.8954 35.3734 46.6348 16.3071
temp: 298.150 k
press: 1.00000 atm
elementType: 8 8 7 6 6 6 6 6 6 6 6 6 6 6 6 6 6 1 1 1 1 1 1 1 1 1 1 1 1 1 1 1 1 1 1 1 1 1 1 1 1 1 1 1
symmnumber: 1
zpe: 1027929.9 jmol-1
zpe.correction: 0.391518 hartree
zpe.thermalcorrener: 0.411401 hartree
zpe.thermalcorrenthalpy: 0.412345 hartree
zpe.thermalcorrgfe: 0.340818 hartree
zpe.sumelectzpe: -753.485800 hartree
zpe.sumelectthermal: -753.465916 hartree
zpe.sumelectthermalent: -753.464972 hartree
zpe.sumelectthermalfe: -753.536499 hartree
dipole: 0.2718 -1.2268 0.1988
dipole: 1.2722
quadrupole: -97.4875 -107.1728 -106.5583
quadrupole: 1.4029 3.4883 -1.2331
quadrupole: 6.2520 -3.4332 -2.8188 1.4029 3.4883 -1.2331
hfenergy: -753.8773176 hartree
pointgroup: C01 [X(C14H27N1O2)]
dipole: -0.111085 0.1481409 0.4650097 debye
polarizability: 197.5333514|-4.1235644|146.8779958|-3.9022525|5.0628099|150.2872367 unknown
InChI: InChI=1S/C14H27NO2/c1-4-15(5-2)10-11-17-14(16)13-9-7-6-8-12(13)3/h12-13H,4-11H2,1-3H3
charge 0 multiplicity 1
44 atoms
O  -0.0176 1.472329 0.054631
O  0.758758 -0.535413 -0.83815
N  -3.465787 -0.093234 -0.071998
C  2.949987 -0.075884 1.346851
C  2.314274 0.981617 0.384563
C  3.502177 -1.305148 0.581153
C  3.309403 1.348558 -0.763678
C  4.494221 -0.896149 -0.533914
C  3.848729 0.110385 -1.514779
C  1.982472 -0.487092 2.478369
C  0.983186 0.520786 -0.195167
C  -1.377749 1.157035 -0.478559
C  -2.173884 0.3092 0.531862
C  -4.604971 -0.088841 0.882125
C  -3.355608 -1.3499 -0.865159
C  -5.079686 1.33195 1.242158
C  -4.396609 -1.442231 -1.996382
H  3.819147 0.444304 1.807476
H  2.097541 1.897159 0.9648
H  2.657226 -1.863463 0.134877
H  4.000433 -1.982762 1.303062
H  4.158098 1.890677 -0.298052
H  2.827244 2.054134 -1.467692
H  4.836288 -1.794695 -1.08283
H  5.396249 -0.436645 -0.076414
H  4.587818 0.434364 -2.273263
H  3.019559 -0.386008 -2.053302
H  2.492359 -1.141385 3.209578
H  1.59406 0.394734 3.022016
H  1.117816 -1.048393 2.075677
H  -1.853353 2.136664 -0.635017
H  -1.271255 0.623193 -1.438782
H  -1.559309 -0.569125 0.838529
H  -2.356773 0.910725 1.439426
H  -5.443309 -0.626258 0.402833
H  -4.359622 -0.655073 1.816462
H  -2.342522 -1.380134 -1.307362
H  -3.433022 -2.249621 -0.203751
H  -5.93937 1.288356 1.936905
H  -5.387461 1.871207 0.32936
H  -4.283615 1.92109 1.733496
H  -4.254257 -2.37447 -2.574375
H  -4.292822 -0.581694 -2.680218
H  -5.431459 -1.444751 -1.608063
