program: Gaussian 09
title: 000213421
version: EM64L-G09RevD.01
frameworkgroup: C1[X(C21H27NO3)]
method: RPBEPBE
basis: SDD
operation: Freq
keyword: #p
keyword: freq=noraman
keyword: PBEPBE/SDD
title: #p freq=noraman PBEPBE/SDD
converged: YES YES NO NO
title: Mulliken charges:
elementType: O O O N C C C C C C C C C C C C C C C C C C C C C H H H H H H H H H H H H H H H H H H H H H H H H H H H
charge: -0.451781 -0.296802 -0.309084 -0.098173 -0.371319 -0.361817 -0.388574 -0.391354 -0.398838 -0.378056 -0.133173 -0.313145 0.285292 0.176755 -0.339972 -0.347610 -0.238915 -0.230819 0.246316 0.289679 -0.368477 -0.383106 -0.786443 -0.249268 -0.243282 0.220583 0.171834 0.207315 0.175985 0.192586 0.200994 0.199562 0.193115 0.214102 0.190303 0.226389 0.219636 0.215814 0.237509 0.227146 0.370532 0.252097 0.256772 0.226994 0.230820 0.264812 0.231770 0.241263 0.238379 0.213522 0.233845 0.228290
chargesum: 0.00000
title: Mulliken charges with hydrogens summed into heavy atoms:
elementType: O O O N C C C C C C C C C C C C C C C C C C C C C
charge: -0.081249 -0.296802 -0.309084 -0.098173 0.021098 0.021483 0.005005 0.001324 0.005567 0.067969 0.082641 0.151510 0.285292 0.176755 -0.087875 -0.090839 -0.011922 0.000002 0.246316 0.289679 -0.103666 -0.151336 -0.093279 -0.015423 -0.014992
polarizability: 2.29819400e+02 -9.72562235e+00 2.80230822e+02 -8.51136750e+00 2.63440226e-01 2.12365214e+02
1716.lowfreq: -7.9685 -2.9407 -0.0005 0.0003 0.0005 3.0575 11.2024 18.2011 30.6465
frequency: 10.5650 17.9108 30.6255 40.6706 43.1759 59.7422 71.3953 92.3980 96.2030 124.9073 131.3870 157.9012 168.1647 180.2905 205.5743 229.7126 240.3422 245.7451 285.4808 297.9922 302.7634 308.7850 354.7786 383.8447 397.1272 427.0148 433.1853 437.6206 449.6903 464.6785 468.7882 476.3460 509.9516 522.3066 538.0859 548.2778 571.6768 586.7451 614.2177 628.1435 705.3715 712.6933 738.1302 756.2939 760.3818 763.8576 777.1426 801.3785 804.4978 829.8006 843.8840 852.3352 854.9876 856.6825 864.4208 897.7381 920.3124 928.0350 933.6308 945.3942 958.2393 968.8697 974.9311 985.2516 990.3707 997.5320 1035.4888 1040.5020 1046.1876 1046.6459 1056.2668 1080.9555 1093.0001 1104.8765 1110.6658 1116.0715 1122.9613 1148.2076 1158.6165 1164.5997 1166.3015 1170.2536 1174.4185 1185.6165 1219.7154 1229.9605 1238.5675 1253.6273 1259.3152 1264.8562 1266.3140 1280.5210 1281.9147 1292.5266 1324.6150 1329.3381 1339.6670 1342.3466 1347.1414 1351.3672 1364.9190 1372.3645 1381.0699 1382.8006 1388.9593 1401.5260 1426.9710 1435.2524 1447.6120 1452.0001 1458.0509 1462.0492 1464.6255 1467.1218 1473.5955 1475.1771 1479.6599 1482.4893 1484.3888 1583.8403 1592.2258 1607.3191 1609.3134 2827.4886 2836.3812 2921.8626 2967.2273 2982.5269 2983.5913 2984.0897 2984.4256 3022.2359 3027.8368 3033.1961 3035.6439 3044.6074 3050.6104 3053.6010 3059.5336 3060.7919 3091.2881 3124.8891 3136.9644 3138.0658 3151.8781 3152.9836 3163.7810 3169.3271 3175.6097 3493.6424
redmass: 4.9264 4.6750 4.0009 4.0790 3.3690 4.8680 4.3628 4.0909 4.0105 1.1119 3.8611 3.7594 4.0910 4.2247 2.9372 3.5688 1.8499 3.8687 5.0728 5.8720 2.7228 3.9862 2.2436 1.7909 3.4519 2.3698 3.8420 2.8054 2.8135 2.2609 1.9353 2.0733 4.0041 4.6291 3.7886 4.2698 2.2245 5.8793 5.5367 4.1006 4.3931 3.3767 2.6789 1.2970 3.0963 1.6977 4.5979 3.3565 1.7000 2.9320 1.4663 2.2356 1.7092 1.4342 3.5524 2.3596 2.1171 1.5585 1.3659 3.1435 1.3484 1.3026 1.3140 1.6003 2.2429 2.3890 2.0268 2.0216 1.5554 2.0643 1.9250 1.6990 2.3989 2.2082 1.9547 1.9831 2.4308 1.2984 2.1859 1.8728 1.1467 1.1408 1.2551 2.2133 2.4163 1.4726 1.3077 3.0555 1.2987 1.2299 1.5208 1.4785 1.6109 1.3906 1.4321 1.2782 1.4205 1.4074 1.4528 1.3734 1.3477 1.4135 5.1789 5.4687 1.4331 1.2978 2.0198 2.1723 1.1908 1.0922 1.0465 1.0873 1.0848 1.0888 1.0967 1.5893 1.6497 1.2756 1.9498 6.6326 6.6065 6.5109 7.4064 1.0716 1.0700 1.0683 1.0623 1.0365 1.0599 1.0569 1.0609 1.0871 1.0907 1.0892 1.0917 1.1031 1.0910 1.1037 1.1085 1.0969 1.1002 1.0875 1.0854 1.0880 1.0899 1.0934 1.0942 1.1005 1.1004 1.0661
irintensity: 0.2232 0.0727 0.2579 0.2163 0.5743 0.4355 0.9896 0.2622 0.4877 0.8247 0.6179 0.6911 1.4540 3.4916 3.1064 1.3137 0.5990 5.1611 0.4837 2.6975 2.5964 8.5483 0.9117 0.8830 0.4750 4.0149 5.1718 16.5525 0.7107 39.4940 41.1719 44.1485 2.5770 5.4926 1.4132 1.0025 0.7905 0.1810 0.9514 2.3549 0.5836 3.7027 9.3556 143.4242 14.5288 36.6225 12.1578 6.5740 3.2121 6.4692 1.1959 6.8845 6.5805 1.9002 23.3777 2.7334 14.7789 12.1752 1.8777 67.9646 1.5287 0.1203 0.7557 2.4019 7.5952 34.7025 17.4820 9.4427 7.7451 6.5770 59.2179 6.0800 50.8473 24.0141 67.2849 21.6771 2.6139 7.4619 25.2699 4.7508 17.3797 0.8515 12.2447 103.3684 15.5256 50.6963 52.2869 273.0605 3.4594 4.5918 11.2164 4.0221 17.8799 6.4112 12.8277 3.0247 0.7674 1.7941 0.7810 0.1926 5.4064 13.5040 17.1937 5.6260 3.6929 15.9069 26.4360 33.1459 74.8040 7.2730 12.7368 14.2569 11.8080 7.5029 3.1356 13.8721 118.5056 85.5770 61.8779 19.7861 14.0656 29.0889 13.6440 45.6982 150.8873 65.3195 39.7590 26.8832 8.5847 46.8919 31.4017 53.5401 57.2376 8.8330 27.5203 25.3784 63.6037 100.5097 17.0110 19.0430 23.8647 10.9161 1.5615 5.6318 17.9711 18.5834 16.1748 17.5058 12.9208 102.0993
temp: 298.150 k
press: 1.00000 atm
elementType: 8 8 8 7 6 6 6 6 6 6 6 6 6 6 6 6 6 6 6 6 6 6 6 6 6 1 1 1 1 1 1 1 1 1 1 1 1 1 1 1 1 1 1 1 1 1 1 1 1 1 1 1
symmnumber: 1
zpe: 1145946.0 jmol-1
zpe.correction: 0.436468 hartree
zpe.thermalcorrener: 0.460506 hartree
zpe.thermalcorrenthalpy: 0.461450 hartree
zpe.thermalcorrgfe: 0.380091 hartree
zpe.sumelectzpe: -1094.946544 hartree
zpe.sumelectthermal: -1094.922506 hartree
zpe.sumelectthermalent: -1094.921562 hartree
zpe.sumelectthermalfe: -1095.002921 hartree
dipole: 1.3743 1.3525 0.5550
dipole: 2.0065
quadrupole: -142.6296 -138.9389 -150.2069
quadrupole: -2.2725 0.0477 -7.9079
quadrupole: 1.2955 4.9862 -6.2818 -2.2725 0.0477 -7.9079
hfenergy: -1095.3830122 hartree
pointgroup: C01 [X(C21H27N1O3)]
dipole: 0.5638738 0.1208732 0.5390713 debye
polarizability: 229.7890844|1.7214887|241.061782|-8.7925244|34.787732|251.5645692 unknown
InChI: InChI=1S/C21H27NO3/c1-17-9-3-4-10-19(17)25-21-12-6-5-11-20(21)24-16-18(23)15-22-13-7-2-8-14-22/h3-6,9-12,18,23H,2,7-8,13-16H2,1H3
charge 0 multiplicity 1
52 atoms
O  0.335775 0.787323 -2.467177
O  -0.260756 0.82857 0.317619
O  -2.49672 -0.611023 1.135807
N  3.052276 -0.598683 -0.210345
C  3.079671 -1.695019 0.792632
C  4.325335 -0.518892 -0.970744
C  4.238267 -1.495549 1.791113
C  5.523411 -0.284325 -0.027738
C  5.590782 -1.390988 1.049739
C  1.858633 -0.621275 -1.089702
C  1.377718 0.811781 -1.434359
C  0.907527 1.580154 -0.193686
C  -1.069444 1.412962 1.291351
C  -2.242801 0.683739 1.650155
C  -0.79952 2.643516 1.93638
C  -3.108879 1.173647 2.64371
C  -1.679416 3.132863 2.929606
C  -2.83276 2.402099 3.288163
C  -2.652132 -0.833452 -0.256895
C  -2.588864 -2.197334 -0.653108
C  -2.899212 0.204689 -1.181787
C  -2.775131 -2.483348 -2.026435
C  -2.329048 -3.282076 0.371421
C  -3.077198 -0.115027 -2.5484
C  -3.013894 -1.460605 -2.9747
H  2.111904 -1.698067 1.327321
H  3.194874 -2.696379 0.2990
H  4.251292 0.306055 -1.703773
H  4.498552 -1.461538 -1.555417
H  4.25149 -2.336233 2.511352
H  4.0577 -0.565074 2.36392
H  5.405178 0.702186 0.461417
H  6.458493 -0.256702 -0.619901
H  6.410473 -1.187846 1.764651
H  5.818955 -2.362397 0.56346
H  1.035883 -1.147086 -0.570905
H  2.042911 -1.157686 -2.048703
H  2.206885 1.381321 -1.892646
H  1.707081 1.59916 0.571011
H  0.595715 2.604436 -0.474482
H  -0.49403 0.404099 -2.073546
H  0.101601 3.209542 1.68306
H  -3.989752 0.577362 2.900905
H  -1.453871 4.083697 3.424203
H  -3.511358 2.778367 4.060044
H  -2.963402 1.242479 -0.839718
H  -2.726101 -3.528565 -2.3546
H  -3.133921 -3.316223 1.128706
H  -1.391679 -3.090267 0.925072
H  -2.25969 -4.272337 -0.110114
H  -3.263518 0.687586 -3.269868
H  -3.144981 -1.711239 -4.03237
