program: Gaussian 09
title: 000213376
version: EM64L-G09RevD.01
frameworkgroup: C1[X(C14H15Cl2NO4)]
method: RPBEPBE
basis: SDD
operation: Freq
keyword: #p
keyword: freq=noraman
keyword: PBEPBE/SDD
title: #p freq=noraman PBEPBE/SDD
converged: YES YES NO NO
title: Mulliken charges:
elementType: Cl Cl O O O O N C C C C C C C C C C C C C C H H H H H H H H H H H H H H H
charge: -0.072202 -0.043473 -0.275096 -0.324585 -0.241547 -0.285076 -0.618993 0.028980 -0.381854 -0.333819 -0.401023 0.534838 -0.302030 -0.336304 -0.211258 -0.225674 -0.390623 -0.095621 0.299077 0.208564 -0.469888 0.281459 0.236018 0.223462 0.193918 0.265519 0.242870 0.236356 0.280919 0.282212 0.261323 0.251890 0.216344 0.338787 0.345196 0.281336
chargesum: 0.00000
title: Mulliken charges with hydrogens summed into heavy atoms:
elementType: Cl Cl O O O O N C C C C C C C C C C C C C C
charge: -0.072202 -0.043473 -0.275096 -0.324585 -0.241547 -0.285076 0.064989 0.310439 0.077626 0.125618 0.078203 0.534838 -0.302030 -0.055385 0.070954 0.035649 0.077610 -0.095621 0.299077 0.208564 -0.188551
polarizability: 2.15246919e+02 -2.49678449e+01 1.90861839e+02 -3.62057205e+01 -6.83198419e+00 1.43104693e+02
1716.lowfreq: -13.0315 -2.1295 -0.0029 -0.0019 -0.0013 4.2644 12.2776 14.7548 19.3716
frequency: 10.5552 13.6958 19.1426 23.1735 42.0165 50.6639 63.2411 71.3672 81.6432 114.9299 138.2772 166.0354 177.7925 183.5824 196.0833 226.3613 246.3397 253.3775 286.5218 311.4099 321.6474 355.2516 364.7457 385.3311 419.7583 430.5561 436.0253 452.4138 483.9307 502.5388 535.9107 541.9080 550.0885 615.5277 628.3352 633.4901 640.2212 673.1456 676.6965 700.1427 709.5112 761.5546 804.1793 816.3503 832.4504 852.2804 862.6481 911.1009 926.8301 942.4500 956.7343 966.7986 989.6754 1000.5029 1021.6602 1033.4498 1058.2798 1065.7636 1080.7434 1085.2434 1127.4128 1136.3835 1200.8069 1224.7427 1226.8611 1250.3247 1256.7262 1272.2457 1286.3230 1299.8096 1335.4768 1341.0342 1347.8453 1358.4234 1375.0497 1380.1658 1388.5216 1437.5584 1444.1045 1447.1799 1450.9515 1462.7419 1567.9717 1592.6608 1596.4725 1689.5553 2133.7502 2946.3739 2974.5839 2977.4263 2979.5728 3038.4123 3060.8514 3066.2698 3070.9098 3090.8449 3157.1171 3177.8121 3183.3597 3422.0763 3541.0932 3704.7425
redmass: 10.3689 6.4993 7.4215 6.0707 7.7360 4.8078 5.0997 4.8590 7.2489 4.5699 4.5562 6.0532 16.5051 4.1240 4.7687 5.9879 5.6308 5.2102 6.8705 3.0370 3.4955 2.7388 6.5944 4.9178 3.2884 2.8318 3.2667 2.9839 6.0597 1.1268 1.1613 4.0722 5.7577 5.5733 4.9654 1.2482 5.2202 4.1871 1.2593 11.1400 5.4899 3.4884 3.2845 3.9026 1.6135 4.9516 1.4149 1.9474 4.5502 3.8408 2.0109 1.9845 2.0710 2.2420 3.7655 5.6189 3.3034 2.2415 2.4735 2.5807 2.5582 1.4257 2.1035 1.2103 1.1176 1.1408 1.4078 1.2060 1.4719 1.4938 2.0207 1.2269 1.7788 1.2836 1.7703 3.5365 1.5344 1.0774 1.0831 1.3072 1.1910 1.6269 7.9093 1.2075 7.2928 7.4940 5.9863 1.0672 1.0638 1.0654 1.0641 1.0846 1.0928 1.0994 1.0976 1.0974 1.0885 1.0966 1.0940 1.1594 1.0458 1.1048
irintensity: 0.4694 0.2361 0.2130 0.3862 1.7365 2.9288 7.7501 1.6592 0.7288 1.9051 2.1063 0.2538 0.6579 2.5946 5.0252 11.6543 7.9722 3.7214 0.5365 13.7600 0.6191 7.9093 2.8181 4.3966 19.8016 5.2909 8.8359 11.3736 7.5972 173.0921 97.2522 32.5814 12.4996 2.4754 7.4685 69.9831 8.4789 9.3032 68.3354 32.7632 40.1367 21.5416 27.0162 19.2916 46.7878 7.0503 21.3606 1.8990 23.8251 62.9902 47.3605 70.6972 18.7904 39.8532 30.6381 171.5376 88.9941 32.3098 11.0987 56.2522 9.1685 1.5862 3.3846 47.9008 0.0556 3.5059 0.8963 11.0945 133.1299 109.5646 25.6861 20.4421 88.7067 25.6111 7.0075 8.5026 0.8122 7.4102 16.8026 28.3570 42.4333 41.8059 29.7701 98.3857 39.7548 342.3338 0.8624 53.0539 35.7062 30.7857 50.3531 2.8498 9.8025 14.9770 12.3646 15.3082 0.0668 1.3071 0.8675 56.9364 63.1637 84.9873
temp: 298.150 k
press: 1.00000 atm
elementType: 17 17 8 8 8 8 7 6 6 6 6 6 6 6 6 6 6 6 6 6 6 1 1 1 1 1 1 1 1 1 1 1 1 1 1 1
symmnumber: 1
zpe: 698168.3 jmol-1
zpe.correction: 0.265918 hartree
zpe.thermalcorrener: 0.288301 hartree
zpe.thermalcorrenthalpy: 0.289246 hartree
zpe.thermalcorrgfe: 0.208724 hartree
zpe.sumelectzpe: -1816.597094 hartree
zpe.sumelectthermal: -1816.574711 hartree
zpe.sumelectthermalent: -1816.573767 hartree
zpe.sumelectthermalfe: -1816.654289 hartree
dipole: 0.0664 -0.2176 1.2842
dipole: 1.3042
quadrupole: -144.4037 -125.2142 -134.2189
quadrupole: 9.1400 -5.0961 -6.7688
quadrupole: -9.7914 9.3981 0.3934 9.1400 -5.0961 -6.7688
hfenergy: -1816.8630122 hartree
pointgroup: C01 [X(C14H15Cl2N1O4)]
dipole: 0.0854196 -0.1281936 0.4894543 debye
polarizability: 199.8077138|-23.2433434|195.1766316|-46.3321503|3.3747938|154.2291054 unknown
InChI: InChI=1S/C14H15Cl2NO4/c1-2-5-19-8-12(21-14(17)18)9-20-7-10-3-4-11(15)6-13(10)16/h1,3-4,6,12H,5,7-9,17H2
charge 0 multiplicity 1
36 atoms
Cl 2.606115 2.603211 -0.442174
Cl 4.881492 -2.20904 -1.978081
O  0.133629 0.038593 2.393308
O  -1.016345 1.140461 -0.266587
O  -2.16798 -1.564005 -1.063885
O  -2.914094 2.552354 -0.243806
N  -0.965135 3.079383 -1.446891
C  -1.709949 0.192634 0.649181
C  -1.247831 0.450013 2.094277
C  -1.396052 -1.222323 0.142565
C  1.186073 0.922822 1.858089
C  2.077672 0.168865 0.881341
C  2.78396 0.794838 -0.168217
C  2.263254 -1.230609 1.028844
C  3.637738 0.102396 -1.049086
C  3.108794 -1.966684 0.172545
C  -3.378393 -2.362358 -0.808917
C  3.785731 -1.28379 -0.856435
C  -1.74611 2.296718 -0.629514
C  -4.414754 -1.694506 0.005773
C  -5.291353 -1.148908 0.680328
H  -2.794824 0.397679 0.591296
H  -1.864188 -0.156079 2.782162
H  -1.3975 1.52148 2.338963
H  -1.582791 -1.956577 0.953719
H  -0.337109 -1.283425 -0.154806
H  1.78963 1.254749 2.726924
H  0.751362 1.813506 1.373966
H  1.713967 -1.733701 1.830468
H  4.162586 0.62281 -1.853404
H  3.237463 -3.044593 0.302559
H  -3.774638 -2.580581 -1.815799
H  -3.101561 -3.325182 -0.326874
H  -1.353769 3.946726 -1.805437
H  -0.012791 2.79879 -1.675265
H  -6.056099 -0.65457 1.252267
