program: Gaussian 09
title: 000213441
version: EM64L-G09RevD.01
frameworkgroup: C1[X(C20H29N3O5)]
method: RPBEPBE
basis: SDD
operation: Freq
keyword: #p
keyword: freq=noraman
keyword: PBEPBE/SDD
title: #p freq=noraman PBEPBE/SDD
converged: YES YES NO NO
title: Mulliken charges:
elementType: O O O O O N N N C C C C C C C C C C C C C C C C C C C C H H H H H H H H H H H H H H H H H H H H H H H H H H H H H
charge: -0.308324 -0.286687 -0.283357 -0.290789 -0.295071 -0.104850 -0.157871 -0.104257 -0.334479 -0.358305 -0.388091 -0.395983 -0.448866 0.229285 0.178474 -0.340713 -0.287308 -0.618529 -0.642243 0.612044 -0.589899 -0.562704 0.283830 0.236953 0.047255 -0.535218 -0.523864 -0.515537 0.201119 0.239446 0.213349 0.210075 0.197931 0.220547 0.268055 0.215361 0.237619 0.222891 0.195124 0.278765 0.224306 0.281871 0.223176 0.223775 0.292925 0.225705 0.264940 0.237163 0.226897 0.222557 0.245788 0.213985 0.264350 0.228447 0.258663 0.221327 0.228947
chargesum: 0.00000
title: Mulliken charges with hydrogens summed into heavy atoms:
elementType: O O O O O N N N C C C C C C C C C C C C C C C C C C C C
charge: -0.308324 -0.286687 -0.283357 -0.290789 -0.295071 -0.104850 -0.157871 -0.104257 0.106087 0.065119 0.030387 0.087434 0.011644 0.229285 0.178474 -0.145590 -0.008543 0.110823 0.100162 0.612044 -0.324959 -0.325541 0.283830 0.236953 0.047255 0.160025 0.182917 0.193400
polarizability: 4.48792481e+02 1.56676156e+01 2.73270498e+02 2.42902919e+01 -3.55413340e+00 1.72861717e+02
1716.lowfreq: -13.4251 -2.5839 -0.0015 -0.0007 0.0012 2.9235 8.0145 13.9901 19.5765
frequency: -5.6720 13.1082 19.5478 33.3107 47.5101 52.4355 63.0539 63.5522 75.1057 78.5619 95.0359 110.1607 116.5310 118.8245 136.5072 145.0858 148.1969 158.6113 161.4362 174.9758 186.6963 194.0658 205.1102 210.9069 224.2923 246.1761 268.7353 279.6319 284.1252 299.2021 304.7677 316.0538 325.3939 349.7673 371.2906 388.8516 397.3320 411.4810 418.3893 449.2561 462.0825 476.5695 498.4432 518.9774 547.3376 572.3226 591.9309 599.2718 609.4154 640.7863 644.0296 673.7071 697.4019 729.2785 740.2441 763.8923 781.6275 822.8389 835.8680 838.3791 849.4413 866.6146 889.8720 916.7400 940.9255 950.4004 963.3997 974.8290 998.0883 999.5646 1011.3359 1016.5807 1047.8962 1050.1791 1056.8001 1067.1357 1090.1818 1093.9053 1107.9079 1111.4032 1114.0760 1122.3468 1127.4228 1132.1242 1142.8908 1151.8633 1158.7728 1160.3513 1166.7088 1190.5924 1196.1256 1202.6597 1205.1540 1229.7287 1240.0733 1246.0710 1265.9013 1273.4466 1289.4712 1310.8433 1321.9753 1325.2482 1337.3145 1353.9629 1359.7223 1374.9850 1380.0750 1393.9646 1408.9596 1412.4418 1414.4617 1419.4266 1432.3192 1437.2137 1444.2579 1455.2397 1455.7570 1456.0612 1457.3028 1460.4662 1461.9946 1466.9856 1468.0341 1470.0240 1475.5137 1480.5585 1482.0588 1485.1187 1487.0102 1498.4403 1502.8170 1537.8536 1568.7753 1591.8011 1598.1043 1640.2345 2879.2789 2886.0188 2926.6882 2954.2894 2961.9838 2968.5556 2970.5610 2974.9232 2975.8945 2983.7999 3017.1160 3028.8375 3042.1552 3043.9295 3051.2856 3051.4136 3082.9351 3091.3097 3091.6644 3093.7538 3106.7829 3107.4566 3115.9062 3125.4344 3127.7204 3128.4613 3147.0104 3159.2494 3166.1517
redmass: 4.2400 4.6155 4.8497 4.6010 3.9976 4.1590 4.0356 2.9913 3.2740 2.4532 2.8257 2.9252 3.4383 3.0323 2.2072 1.2613 1.5615 1.2526 1.4330 3.1105 2.8940 3.1382 3.1148 1.9787 3.6338 2.8287 5.2539 1.8403 2.7816 3.8108 2.6938 4.3487 2.3363 3.8513 4.7487 3.3288 3.0773 2.4100 4.0186 3.2959 2.7019 5.1317 4.9927 5.8806 4.1509 5.6949 3.9230 4.2194 3.6436 3.2787 4.0524 4.2482 5.3711 4.7048 3.6981 3.2672 4.3307 4.3088 1.6878 1.7306 1.8883 6.2382 1.7555 2.4296 6.5479 8.6658 3.0172 2.7051 1.9242 2.4548 1.2586 3.6669 2.0823 1.9743 1.4236 6.2637 2.2830 1.2311 1.2351 1.2379 1.2573 2.8029 2.6831 2.4728 1.3901 1.3820 1.4587 1.4907 2.1554 2.4525 1.1109 1.9223 1.5413 1.6447 2.4422 3.1530 1.5856 1.4058 1.3967 1.4237 2.0063 1.9121 1.3093 1.3514 1.4110 4.0419 1.6025 2.4699 2.3287 1.2179 1.7681 1.4922 1.1866 1.3722 1.3605 1.1144 1.0832 1.0802 1.0821 1.0974 1.1053 1.0592 1.0605 1.3850 1.1000 1.0860 1.6500 1.0720 1.0549 1.2506 1.0528 8.5034 7.2113 5.9837 6.2386 5.6890 1.0705 1.0691 1.0647 1.0390 1.0327 1.0361 1.0696 1.0346 1.0667 1.0319 1.0949 1.0908 1.0978 1.0995 1.1041 1.0904 1.0983 1.0948 1.1007 1.1005 1.0920 1.0894 1.0975 1.0997 1.1046 1.1045 1.0884 1.0918 1.0899
irintensity: 1.8099 0.7502 0.5330 1.2818 1.4589 1.7976 5.4546 3.3000 4.4608 8.4036 3.4350 3.5743 4.2242 1.9693 1.0288 1.5280 1.7566 1.0876 2.5201 0.1462 5.5808 7.3825 0.1791 2.0923 7.1886 6.0690 2.7457 0.3008 0.3810 9.9103 2.6694 3.8669 18.0482 4.0703 11.2960 19.0747 0.1866 0.5021 0.4360 2.7892 1.4609 11.5391 7.1849 3.0070 16.8773 27.6024 5.4605 4.2151 20.6522 4.5705 2.5364 6.1285 2.1803 0.1674 1.2522 13.0505 23.1594 3.7654 7.3295 12.3552 26.7543 15.6475 10.3532 3.2120 24.1615 61.0218 10.7179 35.8110 22.5617 102.6714 33.1765 25.0751 19.2393 12.8334 9.6728 239.5312 73.5343 0.3258 22.6621 5.0597 0.2013 46.8507 22.5658 52.2022 1.5601 23.0397 2.0004 34.3964 39.1304 28.8872 4.0160 18.2768 296.0099 52.0917 36.1094 14.5413 179.7542 176.6062 71.6151 3.7976 83.0342 59.1905 5.4200 3.2242 2.3483 12.7955 6.1083 38.8833 72.5621 36.7611 96.7102 132.8369 7.8133 4.0849 33.3009 36.5527 8.2957 5.6023 7.2568 19.5200 22.2569 17.5786 11.2010 100.3976 19.7633 44.8119 74.5189 48.4322 17.3618 9.3566 9.8890 192.5285 146.0436 260.9295 5.9448 213.5706 38.3291 79.4471 71.2187 71.8406 46.7041 89.1306 38.3994 97.8580 90.4817 88.1119 19.1645 72.0268 61.6088 6.9467 40.5359 32.9488 35.1504 9.9840 31.1578 3.0260 18.4720 0.0923 1.9671 22.4459 13.7925 23.0235 24.6105 3.6143 5.7767
temp: 298.150 k
press: 1.00000 atm
elementType: 8 8 8 8 8 7 7 7 6 6 6 6 6 6 6 6 6 6 6 6 6 6 6 6 6 6 6 6 1 1 1 1 1 1 1 1 1 1 1 1 1 1 1 1 1 1 1 1 1 1 1 1 1 1 1 1 1
symmnumber: 1
zpe: 1229129.2 jmol-1
zpe.correction: 0.468151 hartree
zpe.thermalcorrener: 0.497833 hartree
zpe.thermalcorrenthalpy: 0.498777 hartree
zpe.thermalcorrgfe: 0.405379 hartree
zpe.sumelectzpe: -1317.685387 hartree
zpe.sumelectthermal: -1317.655705 hartree
zpe.sumelectthermalent: -1317.654761 hartree
zpe.sumelectthermalfe: -1317.748159 hartree
dipole: -2.2908 3.6424 -3.3702
dipole: 5.4657
quadrupole: -136.2720 -172.2030 -170.9354
quadrupole: 21.2825 17.7873 -5.8451
quadrupole: 23.5315 -12.3996 -11.1319 21.2825 17.7873 -5.8451
hfenergy: -1318.1535376 hartree
pointgroup: C01 [X(C20H29N3O5)]
dipole: -0.9200169 1.2656645 -1.4750278 debye
polarizability: 449.9102706|16.5721767|270.5175678|16.3703345|-16.3625893|174.4968579 unknown
InChI: InChI=1S/C20H29N3O5/c1-21(2)19(25)14-22-8-10-23(11-9-22)18(24)7-6-15-12-16(26-3)20(28-5)17(13-15)27-4/h6-7,12-13H,8-11,14H2,1-5H3
charge 0 multiplicity 1
57 atoms
O  -0.632485 -3.229019 0.634515
O  -6.165384 2.438956 1.669579
O  4.270226 2.624143 -0.665827
O  6.452985 -1.489121 0.7900
O  6.612254 1.245369 -0.016889
N  -4.718879 -0.532168 0.704713
N  -2.111929 -1.547984 0.009074
N  -7.112435 1.305344 -0.135502
C  -3.556282 0.386097 0.581213
C  -4.277278 -1.875968 1.169705
C  -2.526078 -0.195579 -0.409157
C  -3.253146 -2.470784 0.185927
C  -5.78973 0.026737 1.570941
C  -0.814542 -2.019399 0.260068
C  -6.368063 1.351589 1.035548
C  0.330692 -1.083165 0.0789
C  1.604094 -1.523555 0.319363
C  -7.742913 2.540206 -0.633716
C  -7.40319 0.067474 -0.880161
C  2.855072 -0.764238 0.205498
C  4.072575 -1.432269 0.488827
C  2.902078 0.605241 -0.186733
C  4.133592 1.281738 -0.269046
C  5.312072 -0.760686 0.4138
C  5.360002 0.616493 0.05863
C  3.053645 3.343135 -1.052005
C  7.575839 -1.533829 -0.173362
C  6.807896 2.456793 0.813098
H  -3.063935 0.553426 1.571289
H  -3.909521 1.365536 0.213058
H  -5.160291 -2.540433 1.223206
H  -3.820648 -1.82782 2.188986
H  -1.662232 0.481182 -0.472766
H  -2.994074 -0.252647 -1.413752
H  -2.851556 -3.427546 0.556198
H  -3.74343 -2.636456 -0.794974
H  -5.426595 0.25715 2.598279
H  -6.590118 -0.733539 1.655518
H  0.150225 -0.054002 -0.24582
H  1.691962 -2.572234 0.637771
H  -8.844154 2.429422 -0.664492
H  -7.478395 3.362426 0.048476
H  -7.384171 2.7763 -1.65381
H  -7.423223 0.291844 -1.962429
H  -6.605396 -0.670589 -0.70285
H  -8.390057 -0.354638 -0.600697
H  4.076552 -2.485501 0.787004
H  1.97431 1.128809 -0.431512
H  2.556032 2.852209 -1.910449
H  2.345321 3.422386 -0.204495
H  3.395374 4.346484 -1.345582
H  7.253385 -2.032612 -1.107824
H  7.947512 -0.519624 -0.391378
H  8.351037 -2.136876 0.323323
H  6.134251 3.264286 0.484049
H  6.635182 2.21881 1.87937
H  7.859668 2.740196 0.655999
