program: Gaussian 09
title: 000213323
version: EM64L-G09RevD.01
frameworkgroup: C1[X(C13H12ClNO2)]
method: RPBEPBE
basis: SDD
operation: Freq
keyword: #p
keyword: freq=noraman
keyword: PBEPBE/SDD
title: #p freq=noraman PBEPBE/SDD
converged: YES YES NO NO
title: Mulliken charges:
elementType: Cl O O N C C C C C C C C C C C C C H H H H H H H H H H H H
charge: 0.004049 -0.440001 -0.240816 -0.340081 0.334733 0.340235 0.554207 -0.406444 -0.404975 -0.489248 -0.796215 -0.796233 -0.337381 0.287501 -0.198861 -0.334354 0.107283 0.245313 0.245230 0.305591 0.242131 0.234645 0.237198 0.241520 0.230842 0.238204 0.262687 0.283982 0.389258
chargesum: 0.00000
title: Mulliken charges with hydrogens summed into heavy atoms:
elementType: Cl O O N C C C C C C C C C C C C C
charge: 0.004049 -0.050743 -0.240816 -0.340081 0.334733 0.340235 0.554207 -0.161132 -0.159745 -0.183657 -0.082241 -0.085667 -0.337381 0.287501 0.063827 -0.050372 0.107283
polarizability: 2.16605466e+02 1.77276889e+00 1.56679407e+02 -2.23948425e+00 8.64768245e-01 1.15543684e+02
1716.lowfreq: -4.6510 -0.0023 -0.0009 0.0013 7.7889 9.4384 26.4382 52.1508 58.8378
frequency: 26.0063 52.1453 58.8250 82.4422 90.9997 123.1899 130.5811 146.9650 156.5387 207.8738 219.0688 262.5589 281.6797 294.3441 299.7244 334.5686 416.4947 430.6784 469.8310 500.1137 527.4941 545.5884 587.7999 613.5750 615.6386 626.5835 639.6402 673.4601 693.7202 736.6849 752.3968 773.0550 810.9962 837.6186 843.9804 950.4711 965.3690 969.4083 981.8420 997.5113 1028.6269 1033.1727 1036.0752 1042.0823 1049.7007 1073.3491 1140.3703 1145.3748 1218.3722 1237.1313 1247.4558 1307.5034 1325.7355 1328.4642 1370.2169 1375.9287 1403.3549 1407.3029 1429.0491 1464.9003 1465.6892 1468.3479 1473.7377 1478.3487 1545.1952 1573.3400 1583.6716 1604.8436 1646.3168 2964.5439 2966.1102 3033.0113 3035.2478 3092.0126 3093.0771 3162.1727 3166.1103 3187.6872 3202.1160 3222.5684 3533.4101
redmass: 4.4099 7.9204 5.0004 6.7716 4.9984 1.5660 1.2127 4.0959 1.6176 4.6346 3.9726 4.6742 3.1118 11.5294 5.3028 4.7511 3.3965 4.6616 3.3582 7.9133 4.7952 2.3321 4.4304 2.9099 1.6754 4.5746 5.5094 6.1685 4.7130 4.7640 3.9516 1.2096 6.5646 1.3446 1.4279 1.6762 1.9238 1.5896 1.3609 4.8081 2.7537 1.6910 2.1018 1.4203 1.4565 2.3038 1.6433 1.4942 1.3980 2.8685 1.5950 3.1901 4.7574 3.0852 8.2071 3.5178 1.2261 1.2863 4.4321 1.0652 1.0591 2.4912 1.1738 1.2539 5.4503 7.6276 5.6573 6.8984 8.9764 1.0388 1.0386 1.0981 1.0981 1.0959 1.0956 1.0929 1.0895 1.0969 1.0926 1.1037 1.0643
irintensity: 0.2165 1.2956 0.0688 0.1488 0.0985 1.7328 0.6803 0.8603 0.8476 1.3759 0.4700 1.5612 0.7465 0.4323 0.3165 1.4484 1.7182 7.0331 18.5322 32.1589 45.5640 30.2771 4.6210 7.9966 83.2867 15.2933 1.3683 16.9481 15.7942 32.2834 8.6331 71.8890 14.3238 0.1810 24.3008 14.2109 1.0505 5.6254 0.6736 98.8738 23.3244 67.7167 132.5703 0.4455 7.1701 51.5821 132.4738 11.4248 4.8618 1.5103 20.7166 12.6713 23.9897 70.8925 14.2444 12.1218 12.8052 0.1146 165.0525 7.6129 22.1226 135.8994 24.8147 2.7183 9.8396 22.2414 6.7914 47.9877 251.5122 64.9165 24.6480 14.4386 22.2630 17.7703 25.3804 2.8918 0.8104 0.8584 8.9479 4.9814 57.0960
temp: 298.150 k
press: 1.00000 atm
elementType: 17 8 8 7 6 6 6 6 6 6 6 6 6 6 6 6 6 1 1 1 1 1 1 1 1 1 1 1 1
symmnumber: 1
zpe: 573544.7 jmol-1
zpe.correction: 0.218452 hartree
zpe.thermalcorrener: 0.234725 hartree
zpe.thermalcorrenthalpy: 0.235669 hartree
zpe.thermalcorrgfe: 0.173456 hartree
zpe.sumelectzpe: -1166.637388 hartree
zpe.sumelectthermal: -1166.621115 hartree
zpe.sumelectthermalent: -1166.620170 hartree
zpe.sumelectthermalfe: -1166.682383 hartree
dipole: 2.5154 1.8925 -0.2657
dipole: 3.1590
quadrupole: -97.2752 -109.3084 -102.3481
quadrupole: 5.7970 -1.7637 3.1800
quadrupole: 5.7020 -6.3311 0.6291 5.7970 -1.7637 3.1800
hfenergy: -1166.8558392 hartree
pointgroup: C01 [X(C13H12Cl1N1O2)]
dipole: -1.0477613 -0.6669632 0.0450568 debye
polarizability: 216.1080831|-1.7004724|152.8887887|6.9061917|-12.1660744|119.8316854 unknown
InChI: InChI=1S/C13H12ClNO2/c1-8-3-4-9(2)15(8)12-7-10(13(16)17)5-6-11(12)14/h3-7,16H,1-2H3
charge 0 multiplicity 1
29 atoms
Cl 1.337166 -2.860155 0.311827
O  -4.604266 0.392441 -0.191011
O  -3.229367 2.257178 -0.371545
N  1.530299 0.223508 0.027444
C  2.212913 0.660364 -1.135438
C  2.342468 0.432977 1.169666
C  0.203265 -0.310472 0.044158
C  3.457054 1.138401 -0.716744
C  3.535145 1.002238 0.716996
C  -0.906355 0.552607 -0.088404
C  1.616293 0.543672 -2.509704
C  1.885427 0.083881 2.557406
C  -0.049613 -1.701799 0.181377
C  -2.22937 0.047837 -0.080756
C  -1.361114 -2.220474 0.202753
C  -2.455242 -1.343926 0.070336
C  -3.348173 1.017282 -0.228033
H  4.225763 1.537154 -1.377477
H  4.369518 1.289431 1.355617
H  -0.74116 1.629908 -0.191506
H  2.347772 0.901075 -3.253111
H  1.359964 -0.502546 -2.767299
H  0.696167 1.147639 -2.631424
H  2.637595 0.431065 3.284939
H  0.921794 0.563368 2.817502
H  1.763186 -1.007629 2.699274
H  -1.516727 -3.297299 0.312181
H  -3.478983 -1.726278 0.079519
H  -5.311617 1.083953 -0.293443
