program: Gaussian 09
title: 000213330
version: EM64L-G09RevD.01
frameworkgroup: C1[X(C18H15NO2)]
method: RPBEPBE
basis: SDD
operation: Freq
keyword: #p
keyword: freq=noraman
keyword: PBEPBE/SDD
title: #p freq=noraman PBEPBE/SDD
converged: YES YES NO NO
title: Mulliken charges:
elementType: O O N C C C C C C C C C C C C C C C C C C H H H H H H H H H H H H H H H
charge: -0.441439 -0.241152 -0.363943 0.258993 0.335800 0.410319 -0.411595 0.324962 -0.413888 -0.793134 -0.476034 -0.395530 -0.407861 -0.359753 0.286786 -0.202199 -0.349617 -0.229406 -0.239548 -0.245664 0.105317 0.255341 0.249068 0.242274 0.243085 0.225461 0.305806 0.265228 0.243111 0.243826 0.236077 0.279591 0.223227 0.223454 0.227103 0.385933
chargesum: 0.00000
title: Mulliken charges with hydrogens summed into heavy atoms:
elementType: O O N C C C C C C C C C C C C C C C C C C
charge: -0.055506 -0.241152 -0.363943 0.258993 0.335800 0.410319 -0.156254 0.324962 -0.164819 -0.082314 -0.170227 -0.130302 -0.164750 -0.115927 0.286786 0.033878 -0.070026 -0.006180 -0.016094 -0.018560 0.105317
polarizability: 2.22156810e+02 -7.80042698e+00 2.54558070e+02 3.32369113e+01 6.73633850e+00 1.58240001e+02
1716.lowfreq: -3.7027 -0.0002 0.0003 0.0005 1.0725 7.7093 23.8761 43.8918 47.6781
frequency: 23.8366 43.8691 47.6405 64.7037 74.3868 91.3093 117.9565 141.2485 164.9986 173.8493 214.3086 249.8206 254.3778 305.0848 320.8558 340.6206 381.7597 402.9373 407.5037 426.8072 467.0586 508.0681 518.4512 554.7485 592.8757 608.6805 613.3322 622.5374 636.8690 662.0611 676.9853 690.2158 701.9707 716.6167 737.0197 763.5379 782.7655 801.9567 821.6945 848.3519 851.3028 914.7020 922.0219 937.1877 949.5553 973.3126 975.7086 986.7561 989.9575 991.6770 997.3904 1004.7054 1026.1703 1040.7127 1043.2409 1057.5487 1081.5803 1085.8855 1098.3443 1142.7842 1172.0444 1180.3292 1192.6252 1214.1143 1262.6642 1292.0454 1307.9636 1318.0321 1325.5180 1341.9296 1365.8429 1385.7684 1389.2092 1407.7182 1436.5866 1441.3722 1464.6477 1469.1364 1476.0788 1476.6450 1529.4054 1565.9416 1581.8877 1590.7378 1613.9496 1614.1994 1646.5083 2971.3588 3042.0382 3093.4856 3122.3853 3129.1650 3142.3890 3143.6115 3151.6661 3162.2790 3165.2704 3167.7023 3184.1255 3204.4378 3225.0366 3531.7115
redmass: 6.4164 5.8226 4.6075 4.6785 4.3195 5.1453 3.3250 1.4208 4.0967 3.2232 4.7699 3.7633 4.0271 4.5807 4.5608 5.6458 4.8333 5.0050 2.9158 3.1607 4.7257 3.6691 4.4161 2.5454 4.6802 1.6828 5.7441 3.4146 4.6067 4.3202 5.5140 3.4796 1.8514 2.6917 4.8441 1.6379 1.4001 6.3513 1.5861 1.2484 1.3836 1.6010 3.4441 1.5241 1.4795 1.4999 1.5693 5.2301 5.5047 1.3571 1.4258 3.4473 2.3141 1.5424 1.4519 1.7331 1.6775 1.9709 2.0258 1.6548 1.0537 1.1088 1.1175 1.6335 2.2372 1.6853 2.4100 2.1051 2.4673 4.1500 3.6932 8.3555 5.1576 1.2506 2.4748 3.5467 1.1143 2.1341 1.5302 1.8462 5.6767 5.2912 6.0870 6.6749 6.3436 6.3196 8.8050 1.0388 1.0975 1.0965 1.0843 1.0876 1.0876 1.0924 1.0959 1.0947 1.1014 1.0931 1.0967 1.0924 1.1037 1.0642
irintensity: 0.1973 1.0348 0.2267 1.3603 0.4902 1.2835 0.0543 0.1208 1.5422 0.5298 0.2840 0.7283 0.7574 0.2760 0.8111 7.1183 4.6765 2.6722 0.1649 8.1362 4.9229 17.4017 2.4084 12.7970 53.5905 88.4346 0.8913 8.6167 36.8032 2.1826 8.8629 0.3384 46.8342 36.2342 34.1683 95.8714 28.3244 19.0921 29.3965 0.0566 0.1593 8.0378 3.9889 2.5073 10.0815 0.2016 0.4510 0.8525 0.2005 1.4807 6.8651 113.5268 10.8729 140.8474 11.6760 20.1272 11.4376 4.4293 15.8110 118.1477 0.0563 1.8501 1.9420 14.6192 10.0048 1.5396 3.3797 10.6666 55.6108 43.3520 26.3481 0.6665 59.7087 4.9028 2.7389 117.9738 16.2409 30.2507 18.7478 39.5674 60.1766 2.8025 1.7245 50.2019 30.6996 22.2012 197.9113 51.8038 18.7760 20.8184 4.0773 2.1626 8.5710 21.4704 37.9898 6.3439 18.6144 4.3285 4.3693 9.0957 3.4529 48.5858
temp: 298.150 k
press: 1.00000 atm
elementType: 8 8 7 6 6 6 6 6 6 6 6 6 6 6 6 6 6 6 6 6 6 1 1 1 1 1 1 1 1 1 1 1 1 1 1 1
symmnumber: 1
zpe: 736563.4 jmol-1
zpe.correction: 0.280542 hartree
zpe.thermalcorrener: 0.298457 hartree
zpe.thermalcorrenthalpy: 0.299401 hartree
zpe.thermalcorrgfe: 0.233310 hartree
zpe.sumelectzpe: -898.674101 hartree
zpe.sumelectthermal: -898.656187 hartree
zpe.sumelectthermalent: -898.655243 hartree
zpe.sumelectthermalfe: -898.721333 hartree
dipole: 1.9639 1.3488 1.8750
dipole: 3.0318
quadrupole: -112.7075 -109.5686 -121.9211
quadrupole: 0.0146 7.2208 0.7982
quadrupole: 2.0249 5.1638 -7.1887 0.0146 7.2208 0.7982
hfenergy: -898.9546432 hartree
pointgroup: C01 [X(C18H15N1O2)]
dipole: -0.6440912 -0.2798791 0.9641663 debye
polarizability: 202.2691543|-10.4745191|253.7192284|-43.1251449|-13.4338943|178.9664988 unknown
InChI: InChI=1S/C18H15NO2/c1-13-10-11-17(14-6-3-2-4-7-14)19(13)16-9-5-8-15(12-16)18(20)21/h2-12,20H,1H3
charge 0 multiplicity 1
36 atoms
O  -4.383154 1.968388 0.139767
O  -2.987011 1.719474 -1.698959
N  0.666674 -1.533618 0.093733
C  1.746246 -0.836577 -0.516441
C  0.83108 -2.924947 -0.113494
C  -0.526691 -0.936471 0.630977
C  2.58391 -1.806334 -1.089038
C  1.956122 0.620456 -0.446478
C  2.015767 -3.099337 -0.838491
C  -0.177952 -3.949023 0.325804
C  -1.300165 -0.063234 -0.163901
C  -0.935418 -1.234173 1.954819
C  2.564028 1.285415 -1.550189
C  1.624162 1.394616 0.70288
C  -2.476222 0.518312 0.369107
C  -2.11713 -0.662715 2.477115
C  -2.890324 0.217896 1.692482
C  2.832001 2.669109 -1.506855
C  1.882433 2.781201 0.739162
C  2.487754 3.427973 -0.363394
C  -3.257955 1.431588 -0.509049
H  3.534682 -1.595412 -1.576268
H  2.419216 -4.061815 -1.150256
H  -1.201571 -3.700415 -0.013009
H  0.092412 -4.926168 -0.107376
H  -0.219823 -4.073758 1.424774
H  -1.000599 0.17298 -1.189397
H  -0.316672 -1.893589 2.571915
H  2.80532 0.70902 -2.450367
H  1.186364 0.907458 1.580224
H  -2.425206 -0.897298 3.501272
H  -3.802293 0.674625 2.085483
H  3.296709 3.15847 -2.370389
H  1.620061 3.355824 1.634826
H  2.687206 4.504819 -0.332726
H  -4.860159 2.56686 -0.495566
