program: Gaussian 09
title: 000213324
version: EM64L-G09RevD.01
frameworkgroup: C1[X(C13H15N3O)]
method: RPBEPBE
basis: SDD
operation: Freq
keyword: #p
keyword: freq=noraman
keyword: PBEPBE/SDD
title: #p freq=noraman PBEPBE/SDD
converged: NO YES NO NO
title: Mulliken charges:
elementType: O N N N C C C C C C C C C C C C C H H H H H H H H H H H H H H H
charge: -0.272337 -0.355056 -0.400044 -0.499637 0.324846 0.327770 0.447376 -0.411292 -0.412011 -0.527085 -0.390540 -0.787386 -0.789828 0.340732 -0.203474 -0.389968 0.115906 0.246290 0.246068 0.254451 0.265391 0.240308 0.237866 0.227043 0.233891 0.229002 0.240533 0.236368 0.279080 0.332667 0.304477 0.308592
chargesum: 0.00000
title: Mulliken charges with hydrogens summed into heavy atoms:
elementType: O N N N C C C C C C C C C C C C C
charge: -0.272337 -0.355056 -0.067377 0.113432 0.324846 0.327770 0.447376 -0.165002 -0.165942 -0.272634 -0.125149 -0.082169 -0.086402 0.340732 0.032894 -0.110888 0.115906
polarizability: 2.16977200e+02 8.23097803e+00 1.62171852e+02 -1.09918092e+01 -1.95070702e+00 1.15569190e+02
1716.lowfreq: -7.9513 -0.0004 0.0005 0.0005 4.2692 9.1692 28.8994 41.0886 57.9350
frequency: 28.7555 41.0571 57.9184 81.7172 104.8983 110.0010 121.1578 129.3908 145.4199 177.4262 220.1744 242.7341 260.7754 281.5747 283.0608 327.5446 362.1240 379.4149 426.1894 430.1714 502.5455 552.6247 572.5992 585.2805 615.1690 626.1711 661.9521 692.4578 723.3956 734.9704 746.6390 772.4450 781.8114 825.6906 838.3343 880.2762 911.2641 940.2137 962.9568 970.4099 989.7954 1000.4895 1016.6321 1030.7391 1040.0700 1046.8794 1047.4555 1059.2493 1095.5363 1175.3958 1184.4068 1215.5095 1245.8121 1283.1989 1288.0910 1296.0628 1321.3657 1329.3866 1379.8878 1388.2350 1404.8607 1409.4291 1428.9275 1439.6993 1463.8707 1464.9625 1473.8404 1476.9053 1486.8526 1541.3705 1577.0580 1580.8500 1602.0663 1614.4571 1680.6136 2967.4383 2968.9320 3035.9855 3037.6058 3091.2389 3091.8579 3140.5199 3143.0499 3158.5031 3171.9789 3201.2682 3221.9364 3387.3360 3502.3023 3559.6712
redmass: 4.0103 5.6379 4.0612 3.6572 2.0873 2.3139 1.2330 1.5016 1.3177 2.6922 3.3147 3.6473 3.6181 3.0419 4.4154 5.4651 4.7352 4.4479 3.8927 3.0938 4.0065 1.4723 2.7480 4.2917 3.1288 5.2228 6.3225 3.3688 2.4468 4.6799 6.0699 1.2087 1.6984 1.5817 1.3425 6.9225 1.5162 1.4032 2.2869 1.5988 5.8008 1.3672 1.9749 1.9968 1.4172 2.0436 1.4759 2.0505 1.6242 1.1312 2.5517 1.4042 4.3561 2.0414 1.3212 1.3905 4.1441 4.1647 9.5322 2.9836 1.2239 1.2971 3.1058 1.8876 1.0597 1.0522 1.1070 1.2151 2.6145 5.2510 5.9390 6.4853 7.2634 6.4314 1.0611 1.0387 1.0386 1.0978 1.0977 1.0963 1.0961 1.0872 1.0916 1.0928 1.0988 1.0926 1.1039 1.0428 1.0984 1.0792
irintensity: 0.4909 2.8191 0.6491 0.6912 1.8713 9.9169 11.5693 4.2552 0.7697 6.0722 3.5202 2.7669 0.2655 1.3563 33.4690 0.5593 3.5389 2.5707 7.2383 1.3339 7.1264 132.2568 20.0814 2.6065 4.8217 7.0312 0.0871 7.6341 25.1149 4.1526 5.2774 57.2586 155.2389 27.4399 0.2726 18.7237 11.1427 1.6456 1.6036 2.5038 0.3654 0.9955 6.2296 5.0898 0.3743 12.3270 5.2586 2.6292 12.6477 3.2881 6.3273 4.8757 17.8635 59.5079 13.8115 1.8676 24.5589 13.0323 1.0228 99.4181 11.4258 10.1808 52.2037 188.7669 8.9743 21.1865 25.0900 8.6274 69.2424 21.9232 96.2350 123.7410 28.1276 3.4807 28.8605 69.6711 23.2490 13.5435 30.1224 14.6759 33.4493 6.1789 7.6081 2.8360 9.6412 9.0913 5.6962 0.8555 2.2856 26.8466
temp: 298.150 k
press: 1.00000 atm
elementType: 8 7 7 7 6 6 6 6 6 6 6 6 6 6 6 6 6 1 1 1 1 1 1 1 1 1 1 1 1 1 1 1
symmnumber: 1
zpe: 675102.3 jmol-1
zpe.correction: 0.257133 hartree
zpe.thermalcorrener: 0.274013 hartree
zpe.thermalcorrenthalpy: 0.274957 hartree
zpe.thermalcorrgfe: 0.211607 hartree
zpe.sumelectzpe: -742.613714 hartree
zpe.sumelectthermal: -742.596834 hartree
zpe.sumelectthermalent: -742.595890 hartree
zpe.sumelectthermalfe: -742.659240 hartree
dipole: -0.7821 0.4646 0.6086
dipole: 1.0945
quadrupole: -110.1689 -92.5987 -100.4214
quadrupole: -5.7229 2.7580 3.3087
quadrupole: -9.1059 8.4643 0.6416 -5.7229 2.7580 3.3087
hfenergy: -742.8708469 hartree
pointgroup: C01 [X(C13H15N3O1)]
dipole: 0.2811793 -0.0004582 -0.3261201 debye
polarizability: 217.0206603|-12.0791135|143.8065684|-9.3496183|-21.7722369|133.8910138 unknown
InChI: InChI=1S/C13H15N3O/c1-9-6-7-10(2)16(9)12-5-3-4-11(8-12)13(17)15-14/h3-8,15H,14H2,1-2H3
charge 0 multiplicity 1
32 atoms
O  -4.199636 0.287104 0.533272
N  1.900205 -0.067966 -0.086941
N  -3.059194 -1.725303 0.350794
N  -4.191741 -2.517451 0.684939
C  2.460144 -0.422033 1.166211
C  2.815782 -0.381014 -1.122518
C  0.601676 0.517197 -0.280561
C  3.727682 -0.953917 0.910492
C  3.945805 -0.935649 -0.514239
C  -0.559344 -0.20541 0.08088
C  0.481158 1.820867 -0.82046
C  1.767657 -0.158533 2.475181
C  2.501616 -0.176571 -2.579019
C  -1.842622 0.372503 -0.087721
C  -0.797763 2.396609 -0.989112
C  -1.955354 1.682744 -0.61694
C  -3.11766 -0.334818 0.29317
H  4.421754 -1.304513 1.673334
H  4.826279 -1.295289 -1.045255
H  -0.433885 -1.20375 0.514294
H  1.387078 2.379681 -1.076562
H  2.464016 -0.381323 3.300535
H  1.451854 0.897599 2.575263
H  0.865512 -0.782335 2.625375
H  1.547323 -0.654723 -2.872806
H  2.429639 0.891268 -2.861758
H  3.304325 -0.626568 -3.186411
H  -0.887309 3.408867 -1.397064
H  -2.954524 2.11862 -0.715402
H  -2.2546 -2.248003 0.004108
H  -4.420132 -2.405396 1.683329
H  -4.998544 -2.238293 0.10669
