program: Gaussian 09
title: 000213328
version: EM64L-G09RevD.01
frameworkgroup: C1[X(C18H15NO2)]
method: RPBEPBE
basis: SDD
operation: Freq
keyword: #p
keyword: freq=noraman
keyword: PBEPBE/SDD
title: #p freq=noraman PBEPBE/SDD
converged: YES YES NO NO
title: Mulliken charges:
elementType: O O N C C C C C C C C C C C C C C C C C C H H H H H H H H H H H H H H H
charge: -0.405860 -0.243087 -0.345705 0.291229 0.355083 0.305151 -0.420778 0.310215 -0.416436 0.144079 -0.811115 -0.330835 -0.417869 -0.353447 -0.358554 -0.213683 -0.235075 -0.231255 -0.242201 0.057550 -0.248033 0.253469 0.247335 0.238565 0.241932 0.247348 0.274013 0.242733 0.253932 0.275008 0.238248 0.239467 0.222584 0.223189 0.226560 0.386241
chargesum: 0.00000
title: Mulliken charges with hydrogens summed into heavy atoms:
elementType: O O N C C C C C C C C C C C C C C C C C C
charge: -0.019619 -0.243087 -0.345705 0.291229 0.355083 0.305151 -0.167309 0.310215 -0.169101 0.144079 -0.083270 -0.056822 -0.175136 -0.099515 -0.083545 0.024564 0.004392 -0.008670 -0.019012 0.057550 -0.021473
polarizability: 2.52717308e+02 6.19782288e+00 2.27509669e+02 9.01391249e+00 -2.39445843e+00 1.51043357e+02
1716.lowfreq: -13.6531 -3.0776 -0.0006 -0.0002 0.0002 5.6681 32.6237 35.6513 40.0646
frequency: 32.5078 35.6222 39.9662 57.2558 77.6266 92.4322 110.3411 129.7901 146.6293 180.8379 203.4496 248.5076 264.9842 302.2356 311.3798 339.4918 373.3707 407.8459 413.0106 430.3719 455.6817 517.4515 538.9430 563.1073 589.5553 597.1358 613.2737 623.8411 633.7893 665.0357 680.1929 693.4420 702.0868 705.8434 758.5173 762.3000 777.1911 780.6520 785.9732 846.4917 849.9509 893.2755 915.3456 923.0324 972.7001 974.7218 975.4510 987.2798 991.5627 994.7960 1001.3558 1010.0443 1026.2077 1041.4919 1042.4993 1055.8232 1079.8467 1085.6238 1114.6517 1161.0342 1171.1789 1175.9699 1191.5087 1213.2344 1262.9389 1274.2526 1309.5631 1316.5025 1326.7582 1338.6421 1365.5358 1376.1165 1390.9468 1407.6980 1436.0439 1440.7433 1463.6815 1469.4325 1476.7480 1482.9217 1530.5682 1564.6526 1576.5835 1582.0645 1606.2816 1614.4826 1628.4340 2970.5287 3040.3118 3092.3350 3120.8559 3128.5799 3139.0654 3142.5782 3151.9836 3154.8755 3164.0714 3166.3515 3174.8433 3203.2397 3224.0808 3515.0225
redmass: 5.9014 9.8926 4.3981 4.7237 3.9433 4.7239 3.6495 2.4266 1.6145 3.2443 4.3698 5.1952 3.8020 4.6808 4.4874 6.5083 4.4324 2.8738 3.7706 5.1257 3.9005 3.5551 4.3422 3.3271 1.7210 2.6144 5.5538 3.5135 5.7761 4.7800 4.2995 4.6599 1.9064 4.1528 4.3101 1.6250 3.6532 1.5106 1.5028 1.3831 1.2474 1.4221 1.5483 4.6513 1.6521 1.4460 1.4740 4.6436 1.3671 3.8563 1.3463 4.5138 2.3033 1.3752 1.4473 1.9886 1.6951 2.2703 2.1771 1.5957 1.0542 1.0667 1.1188 1.6345 1.6771 2.8346 1.8246 2.6415 2.6331 4.7930 3.7168 9.2195 4.6504 1.2511 2.3951 2.5848 1.1188 2.1828 1.1597 2.8473 5.7208 5.4348 6.9630 6.2798 6.3905 6.1608 8.7330 1.0387 1.0977 1.0962 1.0844 1.0879 1.0861 1.0935 1.0902 1.0959 1.0950 1.1000 1.1008 1.0923 1.1037 1.0641
irintensity: 0.6082 1.2575 0.3976 0.6996 0.8267 0.8231 0.2549 1.4330 0.5094 0.4097 1.1301 1.2846 3.2711 0.6297 1.3104 1.1584 3.2683 0.2061 5.3225 9.3018 4.7955 1.7362 7.3492 4.3885 46.4934 47.6547 0.5533 2.5367 7.6954 9.5926 15.1592 28.2061 43.4893 25.7327 9.1820 90.4939 21.9500 19.5515 52.2807 0.2086 0.4179 0.1350 3.6484 3.7191 3.0863 2.8221 0.5782 1.2748 0.0585 1.8107 0.1538 142.1538 9.2976 15.1901 3.9392 31.7639 12.0363 4.5465 22.6474 46.7427 0.0932 0.7919 2.3274 18.5734 3.1075 5.0060 3.1284 44.3725 25.2072 30.0449 32.3606 19.4175 35.1245 3.0016 3.8949 75.9054 13.3936 24.6107 9.0899 59.5686 60.0166 4.7746 5.1393 1.5089 54.9492 49.2314 295.8361 48.4867 18.0385 18.4440 3.6581 3.3611 1.8475 27.1925 6.3459 38.0879 6.8782 13.9015 14.7074 9.1249 3.7781 40.6227
temp: 298.150 k
press: 1.00000 atm
elementType: 8 8 7 6 6 6 6 6 6 6 6 6 6 6 6 6 6 6 6 6 6 1 1 1 1 1 1 1 1 1 1 1 1 1 1 1
symmnumber: 1
zpe: 735506.4 jmol-1
zpe.correction: 0.280140 hartree
zpe.thermalcorrener: 0.298152 hartree
zpe.thermalcorrenthalpy: 0.299096 hartree
zpe.thermalcorrgfe: 0.232786 hartree
zpe.sumelectzpe: -898.666982 hartree
zpe.sumelectthermal: -898.648969 hartree
zpe.sumelectthermalent: -898.648025 hartree
zpe.sumelectthermalfe: -898.714335 hartree
dipole: -0.1934 -1.1388 -1.4437
dipole: 1.8489
quadrupole: -123.6614 -110.8279 -116.5871
quadrupole: 1.8813 -2.3656 3.6380
quadrupole: -6.6359 6.1976 0.4384 1.8813 -2.3656 3.6380
hfenergy: -898.9471215 hartree
pointgroup: C01 [X(C18H15N1O2)]
dipole: -0.0052858 -0.430943 -0.5860115 debye
polarizability: 246.3991743|3.881398|226.6153128|27.7911592|-1.5465111|158.2558475 unknown
InChI: InChI=1S/C18H15NO2/c1-13-11-12-16(14-7-3-2-4-8-14)19(13)17-10-6-5-9-15(17)18(20)21/h2-12,20H,1H3
charge 0 multiplicity 1
36 atoms
O  1.125491 0.273817 2.422899
O  3.08711 -0.943934 2.631542
N  0.594793 0.944677 -0.25162
C  -0.747942 1.403618 -0.304073
C  1.470811 2.052725 -0.24075
C  1.026832 -0.416463 -0.418461
C  -0.697465 2.80625 -0.32059
C  -1.931617 0.528931 -0.254143
C  0.679535 3.207267 -0.281597
C  1.808801 -1.10048 0.558027
C  2.966637 1.916669 -0.263508
C  0.730421 -1.061592 -1.643565
C  -3.096734 0.888293 -0.99109
C  -1.977341 -0.649448 0.545046
C  2.325334 -2.389568 0.256184
C  1.21008 -2.359611 -1.911965
C  2.02788 -3.02169 -0.965624
C  -4.264196 0.098953 -0.933133
C  -3.141577 -1.445026 0.589767
C  2.105013 -0.593005 1.931167
C  -4.291566 -1.078203 -0.148136
H  -1.569238 3.458709 -0.298523
H  1.065041 4.225999 -0.284269
H  3.318627 1.279675 -1.0975
H  3.415435 2.915487 -0.391442
H  3.377649 1.486892 0.669818
H  0.130158 -0.522861 -2.382859
H  -3.071471 1.78458 -1.621418
H  -1.112881 -0.916131 1.160978
H  2.948467 -2.881573 1.009864
H  0.964136 -2.842253 -2.863809
H  2.422745 -4.020605 -1.176976
H  -5.14854 0.395068 -1.509034
H  -3.156535 -2.345711 1.2143
H  -5.195243 -1.696579 -0.108742
H  1.376951 0.561624 3.342435
