program: Gaussian 09
title: 000213320
version: EM64L-G09RevD.01
frameworkgroup: C1[X(C16H17NO4)]
method: RPBEPBE
basis: SDD
operation: Freq
keyword: #p
keyword: freq=noraman
keyword: PBEPBE/SDD
title: #p freq=noraman PBEPBE/SDD
converged: YES YES NO NO
title: Mulliken charges:
elementType: O O O O N C C C C C C C C C C C C C C C C H H H H H H H H H H H H H H H H H
charge: -0.244248 -0.267312 -0.256074 -0.312285 -0.173786 -0.354878 -0.370322 -0.290597 -0.302605 0.241142 -0.354413 0.196023 0.164369 0.565395 -0.505216 -0.339322 -0.409315 -0.147347 -0.202854 -0.337097 -0.209623 0.228258 0.203488 0.270021 0.223698 0.194750 0.220409 0.221862 0.203220 0.203428 0.249427 0.254557 0.237808 0.267141 0.240608 0.241481 0.233987 0.216221
chargesum: 0.00000
title: Mulliken charges with hydrogens summed into heavy atoms:
elementType: O O O O N C C C C C C C C C C C C C C C C
charge: -0.244248 -0.267312 -0.256074 -0.312285 -0.173786 0.076868 0.123397 0.124562 0.122477 0.241142 -0.150985 0.196023 0.164369 0.565395 -0.255789 -0.084764 -0.171507 0.119794 0.279235 -0.103111 0.006598
polarizability: 5.01446873e+02 -2.25242872e+00 1.91881372e+02 1.37035117e+01 -9.80569071e+00 1.01557290e+02
1716.lowfreq: -34.5719 -17.3604 -5.7634 -2.6623 -0.0009 -0.0008 0.0008 8.4135 18.3427
frequency: -34.5613 4.6057 16.2606 29.9776 43.3881 74.0581 87.6344 107.4106 148.2885 163.3106 196.1102 216.7182 241.4390 269.4602 278.8681 289.3626 340.0486 366.4717 370.6410 397.6215 401.4957 433.4076 444.5155 474.8564 508.3532 557.5439 559.6060 607.5064 612.9260 622.8851 676.4943 680.3990 720.2867 764.2305 788.4593 788.8401 807.2114 808.1682 828.8353 836.4584 841.0305 869.0214 896.7498 899.3584 927.1377 934.2900 953.6527 956.2618 978.6716 1008.8287 1016.7160 1031.4757 1048.8104 1058.9653 1064.5756 1069.5892 1102.3724 1120.0551 1127.4754 1163.8386 1182.1041 1189.4819 1196.2939 1202.7852 1232.1966 1253.3082 1255.3102 1269.5301 1272.3816 1293.0724 1311.6678 1322.3264 1331.6090 1339.0263 1349.9356 1363.8064 1365.5830 1391.0983 1412.6614 1444.7473 1446.7090 1451.9421 1455.0245 1455.7726 1478.5713 1487.3363 1531.3157 1598.2310 1609.1683 1619.9921 1636.1473 2947.6248 2960.8100 2972.3070 2980.4489 3016.3030 3079.1163 3082.9498 3088.4642 3089.0443 3095.7112 3096.4373 3100.1194 3109.1744 3137.3476 3141.3394 3178.3738 3184.6825
redmass: 2.3224 4.1355 4.5799 5.9173 5.3000 6.2409 3.0975 5.6825 3.8463 5.6810 2.7159 5.7829 2.7991 3.5758 3.8083 3.2823 4.1774 4.5196 3.9144 2.2030 4.9447 3.0240 3.0058 4.5003 4.5291 3.0746 5.5088 3.7327 6.2063 2.4620 4.5232 9.7881 3.7526 6.7388 4.7631 5.5941 1.5569 3.3391 1.6998 1.7156 10.6391 1.5048 1.9495 2.4160 3.7225 1.3506 1.2919 3.1765 4.7997 2.3594 1.1490 2.5072 2.1790 3.8731 1.4577 3.6260 2.1849 1.0369 1.5949 2.0998 2.4949 1.0976 1.7455 1.4112 1.5741 1.7449 2.4061 1.3535 1.2107 1.7709 1.3492 1.5879 1.4384 1.2224 1.3430 1.3404 1.2837 3.1799 2.5587 1.0841 1.0860 1.1383 1.3107 2.6194 2.0841 1.4184 8.4603 7.1888 6.3211 6.4458 5.9752 1.0680 1.0678 1.0679 1.0649 1.0535 1.0968 1.0954 1.0925 1.0990 1.1189 1.0886 1.0928 1.0890 1.0883 1.0901 1.0924 1.0956
irintensity: 15.0065 0.5184 0.1550 0.0605 0.5591 4.3443 0.3785 0.1804 0.5541 0.4129 4.2023 0.3218 0.9899 3.7117 0.9545 14.5475 13.9769 9.0523 5.0953 1.5792 23.6158 3.2805 0.4727 2.5900 7.1547 31.6755 4.6247 6.4287 1.1658 0.5306 9.3821 0.6500 3.7405 9.2439 16.3239 12.2937 23.6153 8.2212 5.8633 24.3305 21.2996 26.8999 0.0665 1.5072 8.2374 8.8334 8.4441 21.7097 197.2347 23.5521 86.2309 76.5188 31.6919 25.2331 4.2494 36.7044 36.2855 0.0045 10.1888 266.6727 8.5084 0.9590 130.3928 23.5291 99.3374 38.1356 295.3500 46.9304 22.8631 64.5993 32.4366 37.2614 34.7559 9.1987 4.4838 7.6661 8.0565 84.1318 283.0296 16.9766 2.4171 44.3314 60.0531 96.7107 74.4399 51.2809 189.0921 2.4587 173.4719 34.6984 126.0796 44.5194 56.0864 41.9383 104.3207 156.2309 41.6662 18.8114 0.8129 48.0684 30.2404 22.4053 17.4318 10.8513 26.1117 9.5489 3.2618 7.8026
temp: 298.150 k
press: 1.00000 atm
elementType: 8 8 8 8 7 6 6 6 6 6 6 6 6 6 6 6 6 6 6 6 6 1 1 1 1 1 1 1 1 1 1 1 1 1 1 1 1 1
symmnumber: 1
zpe: 787396.5 jmol-1
zpe.correction: 0.299904 hartree
zpe.thermalcorrener: 0.318232 hartree
zpe.thermalcorrenthalpy: 0.319176 hartree
zpe.thermalcorrgfe: 0.248698 hartree
zpe.sumelectzpe: -973.953884 hartree
zpe.sumelectthermal: -973.935556 hartree
zpe.sumelectthermalent: -973.934612 hartree
zpe.sumelectthermalfe: -974.005090 hartree
dipole: 3.2976 2.9259 -0.0518
dipole: 4.4088
quadrupole: -115.7345 -120.0600 -125.5444
quadrupole: 0.5818 1.9754 -2.9275
quadrupole: 4.7118 0.3863 -5.0981 0.5818 1.9754 -2.9275
hfenergy: -974.2537876 hartree
pointgroup: C01 [X(C16H17N1O4)]
dipole: 1.2991408 1.1451939 -0.0970494 debye
polarizability: 501.6197128|-2.2239317|190.4390295|10.8600968|-15.0141263|102.8267921 unknown
InChI: InChI=1S/C16H17NO4/c18-16(17-7-9-19-10-8-17)4-2-1-3-13-5-6-14-15(11-13)21-12-20-14/h1-6,11H,7-10,12H2
charge 0 multiplicity 1
38 atoms
O  -6.985399 1.459612 0.514643
O  5.226231 2.052366 -0.339633
O  6.86459 0.356258 0.124085
O  -3.645571 -2.076716 0.040273
N  -4.652882 -0.014021 -0.335684
C  -4.710582 1.452323 -0.497745
C  -5.988353 -0.652981 -0.339382
C  -5.647274 2.062769 0.571223
C  -6.890773 -0.000016 0.722871
C  -3.516459 -0.819018 -0.16168
C  -2.176273 -0.179553 -0.229323
C  4.593744 0.80692 -0.097579
C  5.562148 -0.188264 0.174916
C  2.818062 -0.811251 0.161955
C  3.230809 0.537306 -0.113456
C  5.196628 -1.509088 0.444695
C  3.809513 -1.801088 0.433701
C  -1.046454 -0.930881 -0.006978
C  6.683372 1.802116 -0.188201
C  1.410109 -1.213877 0.178608
C  0.307111 -0.422091 -0.058322
H  -5.109255 1.694798 -1.504531
H  -3.711427 1.903471 -0.40353
H  -5.844001 -1.727754 -0.139341
H  -6.447408 -0.526809 -1.340967
H  -5.20562 1.915063 1.581152
H  -5.800643 3.139461 0.388309
H  -7.925468 -0.372159 0.648695
H  -6.490986 -0.207908 1.73838
H  -2.073524 0.882724 -0.476954
H  2.508474 1.328451 -0.327346
H  5.94505 -2.27693 0.653911
H  3.484565 -2.826526 0.642105
H  -1.19895 -1.994963 0.225985
H  7.067209 2.400202 0.656142
H  7.189577 2.027033 -1.142142
H  1.225801 -2.273534 0.410315
H  0.433307 0.644056 -0.296371
