program: Gaussian 09
title: 000213297
version: EM64L-G09RevD.01
frameworkgroup: C1[X(C15H24N2O)]
method: RPBEPBE
basis: SDD
operation: Freq
keyword: #p
keyword: freq=noraman
keyword: PBEPBE/SDD
title: #p freq=noraman PBEPBE/SDD
converged: NO YES NO NO
title: Mulliken charges:
elementType: O N N C C C C C C C C C C C C C C C H H H H H H H H H H H H H H H H H H H H H H H H
charge: -0.285402 -0.082631 -0.699188 -0.362797 -0.370256 -0.390814 -0.386408 -0.398974 -0.361165 -0.250968 -0.229971 -0.570771 0.487482 -0.442201 -0.373708 -0.408593 -0.413040 0.482459 0.204764 0.172811 0.166490 0.212496 0.190313 0.204169 0.203557 0.190673 0.213007 0.188880 0.198886 0.213802 0.202190 0.185278 0.184755 0.198476 0.224300 0.197187 0.221007 0.265202 0.210183 0.209152 0.299292 0.300077
chargesum: 0.00000
title: Mulliken charges with hydrogens summed into heavy atoms:
elementType: O N N C C C C C C C C C C C C C C C
charge: -0.285402 -0.082631 -0.099819 0.014777 0.008730 0.003667 0.007822 0.002913 0.051524 0.136501 0.153259 -0.149284 0.487482 -0.221194 -0.108506 -0.198410 -0.203888 0.482459
polarizability: 2.29469453e+02 1.37711612e+01 1.89000183e+02 -1.39767828e+01 5.01458513e+00 1.22411661e+02
1716.lowfreq: -12.6299 -4.7472 -0.0010 -0.0005 -0.0003 1.3325 10.1800 14.7004 31.8613
frequency: 4.7337 12.6314 31.8253 41.6667 65.1524 93.2409 117.7328 122.6969 142.3607 184.5182 221.1258 234.1140 265.3485 293.6914 309.6915 316.7753 348.1845 359.4511 373.9497 384.7318 400.2359 410.7980 446.9481 455.4411 469.1086 493.1403 557.9912 564.7781 639.2909 712.7155 736.0957 751.9853 799.1842 811.7650 814.1997 822.5498 825.4496 829.1138 852.2379 857.5494 904.7881 933.9286 957.4694 960.3811 964.5579 978.6702 996.0894 1004.4706 1017.5292 1035.2319 1046.4779 1050.9808 1075.6260 1090.6352 1101.0690 1115.1254 1125.1624 1127.3120 1149.7923 1159.4293 1173.4349 1184.5902 1190.2508 1219.3407 1235.6777 1246.1328 1258.3155 1264.2375 1282.3358 1291.1086 1308.4564 1312.7398 1317.4720 1328.9101 1336.8257 1340.2273 1344.5004 1350.0757 1363.0500 1378.9272 1384.8112 1405.4976 1432.8347 1449.6645 1452.6314 1458.9791 1463.3140 1465.4468 1468.9012 1474.8161 1481.6366 1488.6309 1519.5240 1581.2341 1632.0584 1643.3077 2816.3573 2826.9281 2893.8858 2910.5863 2927.2125 2965.4262 2965.6571 2983.7890 2984.6770 2985.2000 2986.4075 3024.0680 3029.2507 3035.1778 3035.6812 3044.3031 3044.9126 3054.0119 3103.9482 3112.3610 3129.6807 3157.2561 3569.1471 3709.9555
redmass: 3.0903 4.2692 3.8945 3.5555 3.6341 3.0262 2.6751 3.6335 3.8499 3.1958 2.9138 1.8369 2.5693 3.9103 1.2508 2.1169 3.0307 1.0462 2.4150 2.3940 2.5092 2.7096 2.8436 2.8422 4.1334 2.7145 2.1558 2.0049 6.3387 3.6288 3.1440 3.4808 1.4092 1.2601 1.3809 2.5666 3.7088 1.8263 1.4564 2.5351 2.2649 1.3607 1.3060 1.5138 2.0668 2.7551 2.4547 2.6893 1.5014 3.0200 1.9341 1.8983 3.5604 2.5372 1.5463 2.0677 2.0199 1.2607 1.3475 2.2846 1.1693 1.2037 1.1083 2.0253 1.1918 1.6979 1.2414 1.1889 1.2040 1.3873 2.8216 1.2955 1.3604 1.2922 1.5617 1.4216 1.4361 1.4543 1.3954 1.4224 4.6513 1.4595 3.0042 1.0919 1.1196 1.0880 1.0849 1.0843 1.0867 1.0909 1.0936 1.0853 3.0419 6.6487 1.7803 2.1871 1.0717 1.0699 1.0695 1.0572 1.0587 1.0906 1.0624 1.0623 1.0745 1.0653 1.0942 1.0879 1.0921 1.0914 1.0997 1.0935 1.1020 1.1036 1.0865 1.0891 1.0962 1.0947 1.0447 1.1040
irintensity: 0.1994 0.1739 0.0409 0.1589 0.9289 1.9195 2.6406 5.8563 7.8493 0.3460 2.4884 0.6223 0.0201 3.4472 297.7178 20.3805 6.3021 1.3146 6.6722 1.6957 4.4497 0.1441 0.9777 0.9152 2.1061 4.5483 15.2194 8.5173 0.6651 3.4784 3.2060 11.4412 1.2399 2.6786 21.1609 17.7378 3.5740 44.0636 4.7247 7.0242 2.0455 0.1758 3.1408 1.9031 2.9279 18.3146 17.8743 2.6342 9.2047 98.0676 31.1416 10.2464 86.2118 2.2631 15.8283 18.0310 1.5746 23.8038 5.6028 33.4529 3.0967 1.1382 22.8260 0.3225 6.6234 6.2866 2.7839 4.9908 9.8214 9.9027 50.4034 21.9850 18.7320 1.0196 6.3499 0.5673 1.9528 3.5566 1.8237 8.0211 13.6497 0.3407 1.6315 6.7474 12.1634 13.7895 3.5247 3.0076 22.1348 4.0558 5.0599 5.7667 143.6582 5.6820 3.1001 261.5518 45.2703 154.7286 82.5602 47.4762 114.1401 21.8188 36.0399 21.9187 138.7367 19.3776 23.1995 51.2977 75.9287 17.6604 28.7889 72.1562 4.2909 103.8991 18.4829 28.4809 33.3308 4.5332 59.9970 17.9963
temp: 298.150 k
press: 1.00000 atm
elementType: 8 7 7 6 6 6 6 6 6 6 6 6 6 6 6 6 6 6 1 1 1 1 1 1 1 1 1 1 1 1 1 1 1 1 1 1 1 1 1 1 1 1
symmnumber: 1
zpe: 961765.9 jmol-1
zpe.correction: 0.366317 hartree
zpe.thermalcorrener: 0.384997 hartree
zpe.thermalcorrenthalpy: 0.385941 hartree
zpe.thermalcorrgfe: 0.315142 hartree
zpe.sumelectzpe: -769.295110 hartree
zpe.sumelectthermal: -769.276430 hartree
zpe.sumelectthermalent: -769.275486 hartree
zpe.sumelectthermalfe: -769.346285 hartree
dipole: 0.1878 0.9365 -0.6504
dipole: 1.1556
quadrupole: -90.0160 -95.9253 -114.1990
quadrupole: 8.9342 -7.1762 2.8496
quadrupole: 10.0308 4.1214 -14.1522 8.9342 -7.1762 2.8496
hfenergy: -769.6614269 hartree
pointgroup: C01 [X(C15H24N2O1)]
dipole: -0.0638413 -0.3962021 -0.2136565 debye
polarizability: 228.4746877|16.127241|187.4663587|14.5645895|-11.9033893|124.9402498 unknown
InChI: InChI=1S/C15H24N2O/c16-15-6-4-14(5-7-15)8-12-18-13-11-17-9-2-1-3-10-17/h4-7H,1-3,8-13,16H2
charge 0 multiplicity 1
42 atoms
O  -0.029709 1.139504 0.19357
N  3.465673 -0.193383 0.045821
N  -5.769869 -2.454224 -0.0869
C  4.376235 0.933305 0.374735
C  4.044365 -1.493327 0.471315
C  5.741844 0.766053 -0.320858
C  5.401977 -1.743253 -0.217899
C  6.386039 -0.585008 0.066347
C  2.085265 0.02408 0.543122
C  1.277882 0.899639 -0.426771
C  -0.899126 1.9789 -0.64484
C  -2.250427 2.152954 0.072163
C  -3.166189 0.936579 0.02769
C  -4.444857 1.009694 -0.580797
C  -2.781266 -0.307125 0.597133
C  -5.31203 -0.102006 -0.626127
C  -3.634301 -1.426871 0.560525
C  -4.9184 -1.343733 -0.052602
H  3.903681 1.880073 0.055296
H  4.536683 1.002599 1.484623
H  4.188625 -1.531089 1.584737
H  3.331181 -2.295255 0.203984
H  6.403622 1.608779 -0.041717
H  5.590549 0.804369 -1.416953
H  5.234063 -1.825357 -1.309289
H  5.820196 -2.706836 0.132406
H  7.333527 -0.737195 -0.484645
H  6.638548 -0.574193 1.147315
H  2.063004 0.492989 1.556587
H  1.576293 -0.953361 0.62918
H  1.162877 0.378135 -1.40052
H  1.791548 1.869225 -0.613481
H  -0.413079 2.970683 -0.791668
H  -1.038433 1.505438 -1.641676
H  -2.024711 2.439067 1.119022
H  -2.768248 3.016486 -0.388845
H  -4.774017 1.956859 -1.028073
H  -1.793495 -0.38833 1.062512
H  -6.296124 -0.011042 -1.103499
H  -3.310937 -2.375081 1.00947
H  -6.687615 -2.393644 -0.516811
H  -5.486646 -3.3389 0.322818
