program: Gaussian 09
title: 000213322
version: EM64L-G09RevD.01
frameworkgroup: C1[X(C18H14BrNO2)]
method: RPBEPBE
basis: SDD
operation: Freq
keyword: #p
keyword: freq=noraman
keyword: PBEPBE/SDD
title: #p freq=noraman PBEPBE/SDD
converged: YES YES NO NO
title: Mulliken charges:
elementType: Br O O N C C C C C C C C C C C C C C C C C C H H H H H H H H H H H H H H
charge: -0.001510 -0.440317 -0.239588 -0.364671 0.255687 0.334627 0.406727 -0.406269 0.343965 -0.410999 -0.791959 -0.476651 -0.396926 -0.399135 -0.347836 0.286183 -0.201108 -0.347851 -0.190371 -0.197005 -0.218511 0.106868 0.255008 0.250852 0.227667 0.243271 0.244191 0.305538 0.266887 0.249162 0.251876 0.237796 0.281104 0.247806 0.247777 0.387712
chargesum: 0.00000
title: Mulliken charges with hydrogens summed into heavy atoms:
elementType: Br O O N C C C C C C C C C C C C C C C C C C
charge: -0.001510 -0.052605 -0.239588 -0.364671 0.255687 0.334627 0.406727 -0.151261 0.343965 -0.160146 -0.076830 -0.171112 -0.130039 -0.149973 -0.095960 0.286183 0.036688 -0.066747 0.057435 0.050772 -0.218511 0.106868
polarizability: 2.94189606e+02 3.76683887e+01 2.43428146e+02 -2.47276308e+01 2.55894898e+01 1.66645980e+02
1716.lowfreq: -3.7665 -0.0004 -0.0003 0.0004 3.2388 7.8712 19.7346 34.7809 40.3933
frequency: 19.6309 34.7605 40.3821 53.3247 69.3732 80.9917 91.9474 128.6272 133.0061 164.9899 174.3307 198.7187 216.1860 237.3867 267.1317 279.3099 337.3552 349.2048 375.5311 391.2521 409.3621 426.4963 432.4290 472.1198 508.5885 518.8134 554.4815 592.9027 610.5691 618.9998 624.4321 650.0005 661.5237 684.1403 694.2772 713.8562 721.6387 738.1681 778.5993 801.9947 823.1867 826.3353 831.5665 854.6517 919.5934 939.9255 953.4865 955.3643 966.6181 973.9445 990.0106 991.9966 999.0403 1005.5062 1041.2355 1042.8502 1058.8825 1060.2801 1084.7254 1096.0809 1112.5186 1143.1801 1180.6229 1191.5387 1214.8176 1263.6418 1292.1667 1295.5113 1313.2595 1323.7115 1341.1989 1346.0372 1384.6492 1386.8118 1402.0840 1407.2302 1441.4370 1460.7765 1463.7842 1475.1339 1476.4233 1523.4826 1559.6315 1570.4527 1589.9439 1600.8952 1614.7176 1646.6461 2972.9407 3043.9544 3094.2317 3142.5637 3143.4198 3150.2116 3161.8029 3166.6952 3169.0560 3173.2969 3184.1914 3205.2664 3225.5028 3531.5735
redmass: 10.7671 6.3586 4.5383 6.7422 4.9457 4.1939 5.6477 1.3742 3.2021 4.1663 6.3771 8.4604 5.2147 4.4280 3.8591 4.8708 4.9380 5.5400 4.3896 6.8035 2.9348 3.4516 5.0514 4.4944 3.6647 4.1170 2.5690 4.7065 1.6602 4.5404 3.8959 4.9668 4.8630 5.8135 3.2853 3.5143 2.8104 5.2888 1.2734 6.1883 1.5784 1.2913 1.5065 1.4265 5.1669 1.4410 1.3491 1.4742 1.3807 1.6895 5.8855 4.5067 1.4348 3.3842 1.5261 1.4781 1.7321 3.0202 2.0965 1.8639 1.4385 1.6543 1.1072 1.1184 1.6298 2.2888 1.5210 1.3783 4.4716 2.4377 4.8086 3.9720 6.2852 7.0117 3.0572 1.2884 3.6704 2.3189 1.1031 1.1862 2.7018 6.1984 5.7743 6.7516 6.6560 6.2976 6.4869 8.8715 1.0387 1.0975 1.0965 1.0876 1.0886 1.0880 1.0947 1.0930 1.0960 1.0972 1.0967 1.0923 1.1039 1.0642
irintensity: 0.0603 0.9681 0.1401 0.7337 0.5589 0.3426 0.8543 0.3938 0.6195 1.3992 0.0922 1.1113 0.3310 0.5176 2.1077 0.8764 5.1718 0.4892 5.0775 9.4165 0.3346 12.4702 3.0924 7.1932 26.3845 7.2059 12.5273 53.0352 98.4969 7.3906 6.0248 17.6608 6.5082 2.3434 2.8853 3.2269 65.3729 17.3886 77.2467 10.6382 21.9063 11.7240 56.8676 4.5283 16.3763 1.0274 2.2311 11.0119 0.6716 1.0751 0.2683 38.8594 8.4318 109.8030 116.2775 40.6300 19.7168 27.3282 14.1679 13.4886 13.8783 114.2348 1.4145 4.8277 20.4212 10.4188 0.6916 2.1144 7.5172 53.2847 0.7227 66.5703 8.1783 28.2284 31.0783 6.7524 110.9358 62.0367 19.8110 5.1688 50.6568 129.4659 6.2610 2.7219 46.8686 8.0582 13.7410 194.5200 52.1250 17.9123 19.7155 7.8596 5.4023 6.3526 5.9699 4.0528 11.9066 0.5556 4.0259 8.8593 3.3280 50.4457
temp: 298.150 k
press: 1.00000 atm
elementType: 35 8 8 7 6 6 6 6 6 6 6 6 6 6 6 6 6 6 6 6 6 6 1 1 1 1 1 1 1 1 1 1 1 1 1 1
symmnumber: 1
zpe: 709739.2 jmol-1
zpe.correction: 0.270325 hartree
zpe.thermalcorrener: 0.289832 hartree
zpe.thermalcorrenthalpy: 0.290776 hartree
zpe.thermalcorrgfe: 0.219681 hartree
zpe.sumelectzpe: -911.464247 hartree
zpe.sumelectthermal: -911.444741 hartree
zpe.sumelectthermalent: -911.443796 hartree
zpe.sumelectthermalfe: -911.514892 hartree
dipole: -4.1371 0.5378 1.9149
dipole: 4.5904
quadrupole: -133.3332 -124.2000 -135.0281
quadrupole: -1.4511 -8.6751 6.2780
quadrupole: -2.4794 6.6538 -4.1743 -1.4511 -8.6751 6.2780
hfenergy: -911.7345726 hartree
pointgroup: C01 [X(C18H14Br1N1O2)]
dipole: 1.3037567 0.7299706 1.0143662 debye
polarizability: 228.5597385|41.7429305|291.782256|45.9321069|-4.3551002|183.9217374 unknown
InChI: InChI=1S/C18H14BrNO2/c1-12-5-10-17(13-6-8-15(19)9-7-13)20(12)16-4-2-3-14(11-16)18(21)22/h2-11,21H,1H3
charge 0 multiplicity 1
36 atoms
Br -4.578421 -3.528891 -0.484858
O  3.440283 -3.408937 0.194699
O  2.351109 -2.579367 -1.68146
N  0.230291 1.829812 0.101533
C  -1.023346 1.642742 -0.543154
C  0.655916 3.166696 -0.082836
C  1.059695 0.79287 0.657414
C  -1.374452 2.876637 -1.114959
C  -1.815996 0.403329 -0.506394
C  -0.333674 3.819366 -0.828346
C  1.98408 3.680938 0.397467
C  1.455502 -0.300433 -0.142424
C  1.490203 0.876085 2.004996
C  -2.647395 0.080364 -1.617309
C  -1.835627 -0.475233 0.614886
C  2.271267 -1.317311 0.410589
C  2.316614 -0.133135 2.547383
C  2.706611 -1.235342 1.758213
C  -3.467951 -1.066001 -1.61639
C  -2.642397 -1.632589 0.625652
C  -3.45254 -1.916974 -0.492032
C  2.659793 -2.451522 -0.47319
H  -2.314639 3.080682 -1.625294
H  -0.298813 4.865429 -1.12925
H  2.045231 3.759838 1.499624
H  2.824056 3.039802 0.069452
H  2.148607 4.689496 -0.016091
H  1.137604 -0.374882 -1.186857
H  1.16019 1.717588 2.622681
H  -2.634404 0.72621 -2.501669
H  -1.237787 -0.24775 1.502364
H  2.644299 -0.063023 3.58967
H  3.337372 -2.029203 2.166477
H  -4.095061 -1.297747 -2.481987
H  -2.646078 -2.293103 1.497459
H  3.664658 -4.139045 -0.442459
