program: Gaussian 09
title: 000213310
version: EM64L-G09RevD.01
frameworkgroup: C1[X(C16H23NO2S)]
method: RPBEPBE
basis: SDD
operation: Freq
keyword: #p
keyword: freq=noraman
keyword: PBEPBE/SDD
title: #p freq=noraman PBEPBE/SDD
converged: YES YES NO NO
title: Mulliken charges:
elementType: S O O N C C C C C C C C C C C C C C C C H H H H H H H H H H H H H H H H H H H H H H H
charge: 0.195455 -0.257760 -0.225616 -0.079219 -0.305512 0.427373 -0.827205 0.388684 -0.660743 -0.680664 -0.404336 -0.383343 0.359794 -0.246863 -0.236628 -0.306591 -0.387799 -0.336320 -0.622612 -0.615044 0.303728 0.279141 0.203384 0.224184 0.206973 0.245274 0.228337 0.237449 0.243650 0.227762 0.229313 0.231082 0.222682 0.247593 0.215407 0.170120 0.213743 0.222246 0.184868 0.231034 0.228197 0.186065 0.222716
chargesum: 0.00000
title: Mulliken charges with hydrogens summed into heavy atoms:
elementType: S O O N C C C C C C C C C C C C C C C C
charge: 0.195455 -0.257760 -0.225616 -0.079219 -0.305512 0.427373 -0.523477 0.388684 0.045966 -0.000080 -0.166887 -0.139692 0.359794 -0.019101 -0.007315 0.147174 0.075201 0.047544 0.015536 0.021934
polarizability: 2.44785888e+02 1.86968044e+00 2.03401651e+02 -2.32028638e+01 1.18996127e+00 1.54748837e+02
1716.lowfreq: -21.2331 -10.2943 -6.0829 -0.0005 0.0017 0.0025 6.7032 14.7986 19.7526
frequency: -15.8149 12.8644 19.0898 45.7060 55.0872 74.2105 83.3157 105.1054 113.9494 144.5852 158.3664 198.5417 216.6363 222.7402 230.2207 239.5132 246.9860 270.7883 281.9411 293.1209 307.2041 316.5566 344.7830 353.6720 374.9726 392.8112 409.6747 455.4203 470.2462 498.4066 517.1458 551.3135 583.9330 623.9386 659.2224 669.8125 730.6861 751.6302 762.9543 767.6203 776.8098 802.8083 843.0440 850.3717 877.0678 891.0449 916.2513 942.7037 949.7750 953.4093 987.3417 1006.5850 1019.8936 1030.7695 1033.2256 1059.7919 1067.8363 1081.8827 1090.4758 1098.7736 1101.9767 1103.4244 1143.3703 1145.5122 1160.2359 1170.8747 1175.3794 1188.7906 1206.4868 1232.0834 1258.3402 1259.6804 1280.0468 1282.4189 1286.3277 1297.5360 1304.5696 1368.4958 1377.5327 1380.0371 1381.2312 1396.7796 1417.8711 1436.8688 1440.9089 1455.4121 1456.0237 1461.2129 1461.6384 1462.9484 1473.4749 1474.3606 1477.1004 1478.7820 1482.3081 1486.3752 1488.3980 1593.2571 1608.3423 1635.1191 2810.7173 2840.4365 2858.1346 2971.9224 2980.6485 3004.6320 3011.8704 3019.6279 3023.1511 3030.7592 3066.3191 3070.4297 3071.8001 3072.1056 3078.6437 3087.4329 3100.0764 3102.9699 3103.0653 3122.4419 3128.3873 3143.0515 3162.8926
redmass: 2.7984 4.9180 3.8208 5.3428 4.3840 4.4032 2.6991 2.3587 2.9665 4.0623 4.7283 4.1435 2.7020 1.2702 1.1074 1.1185 2.2855 1.7965 1.9144 3.3668 2.8240 2.7270 2.7841 3.7498 3.5265 3.8069 8.5368 2.7592 3.5142 3.6142 4.1244 3.4336 5.4492 4.6202 6.8640 4.8262 3.2966 2.9096 3.9788 1.5606 1.2288 4.9946 4.4334 2.0906 1.3957 2.2701 2.5267 1.5440 1.5673 4.3261 1.3271 1.2906 2.6130 2.3453 1.5291 3.9205 2.2898 2.6137 1.3565 2.0213 2.0505 1.6932 1.6462 1.7859 1.1946 2.9760 1.1168 1.7066 2.4146 1.6087 2.1611 1.8637 1.9802 1.4543 1.1013 1.8519 1.2813 1.3015 1.4101 1.1874 8.8590 1.1943 1.1430 2.2650 1.1664 1.0688 1.0807 1.0536 1.0602 1.0647 1.1566 1.0732 1.0511 1.5400 1.0707 1.3149 1.0742 7.3270 6.5708 9.0461 1.0705 1.0576 1.0575 1.0371 1.0364 1.0743 1.0700 1.0720 1.0581 1.0712 1.0973 1.1030 1.0947 1.0883 1.1012 1.1006 1.1005 1.1013 1.1082 1.0855 1.0895 1.0943 1.1005
irintensity: 0.5004 0.6557 0.4433 0.3440 0.9315 0.4304 0.6420 0.1135 2.3312 0.6744 0.7047 0.8064 0.6777 1.5745 0.2624 0.0884 0.5292 1.5731 2.5670 8.0453 2.3424 10.4178 8.3140 0.6350 5.3029 1.4140 0.7802 4.0324 9.5183 4.7228 1.2949 6.8208 5.2760 4.2089 8.2863 24.0420 5.9667 12.0254 9.4267 53.3807 3.0594 17.8980 0.3757 0.8858 1.1703 1.3149 2.6181 1.9987 19.1927 84.4026 0.0385 1.3468 9.2554 8.7491 17.6469 15.4748 43.3821 22.5584 21.9828 290.9157 150.9412 5.0269 7.3419 6.5477 1.7438 1.6327 0.2176 7.6047 31.0742 8.8026 5.8815 34.7498 8.4400 5.6441 0.3495 64.4975 19.4976 1.2043 13.5401 23.5483 1.9460 13.5405 2.0374 11.5901 3.6707 12.9771 1.1370 10.9464 3.7833 16.3215 5.7092 5.5231 12.3850 5.0884 8.5988 30.8329 21.3204 1.7467 2.2569 112.6538 79.0706 74.7651 243.4790 25.7912 37.8748 3.4425 19.4087 41.2596 44.5077 48.5963 2.6427 7.5506 34.8586 10.0012 33.3168 45.8386 10.5105 15.2697 33.3155 4.1400 3.8244 27.2317 27.9039
temp: 298.150 k
press: 1.00000 atm
elementType: 16 8 8 7 6 6 6 6 6 6 6 6 6 6 6 6 6 6 6 6 1 1 1 1 1 1 1 1 1 1 1 1 1 1 1 1 1 1 1 1 1 1 1
symmnumber: 1
zpe: 938994.9 jmol-1
zpe.correction: 0.357644 hartree
zpe.thermalcorrener: 0.378574 hartree
zpe.thermalcorrenthalpy: 0.379518 hartree
zpe.thermalcorrgfe: 0.305988 hartree
zpe.sumelectzpe: -1225.222390 hartree
zpe.sumelectthermal: -1225.201461 hartree
zpe.sumelectthermalent: -1225.200516 hartree
zpe.sumelectthermalfe: -1225.274046 hartree
dipole: 1.1231 0.7986 -0.5256
dipole: 1.4749
quadrupole: -103.4670 -123.9048 -131.3862
quadrupole: -6.1425 -8.1208 -3.8641
quadrupole: 16.1190 -4.3188 -11.8002 -6.1425 -8.1208 -3.8641
hfenergy: -1225.5800343 hartree
pointgroup: C01 [X(C16H23N1O2S1)]
dipole: -0.4226571 -0.258074 -0.3024553 debye
polarizability: 246.4855645|-1.5331422|196.2891137|18.7015593|18.5150967|160.161698 unknown
InChI: InChI=1S/C16H23NO2S/c1-16(2)13-9-6-5-8-12(13)14(20-16)15(18)19-11-7-10-17(3)4/h5-6,8-9,14H,7,10-11H2,1-4H3
charge 0 multiplicity 1
43 atoms
S  2.018954 2.669001 -0.129122
O  -1.390673 1.702661 -0.546704
O  -0.324742 0.473699 1.132789
N  -5.588346 -0.902318 0.283462
C  3.303972 1.419243 0.625349
C  3.047971 0.130705 -0.158081
C  0.941877 1.272139 -0.853388
C  1.845356 0.05144 -0.900392
C  3.011782 1.224261 2.132829
C  4.707973 2.014364 0.387211
C  3.927748 -0.976057 -0.138635
C  1.522256 -1.11842 -1.622938
C  -0.285414 1.075979 0.036672
C  3.610183 -2.14606 -0.864964
C  2.408343 -2.218704 -1.607894
C  -2.673386 1.634726 0.218601
C  -3.467127 0.383243 -0.179428
C  -4.833517 0.34648 0.540088
C  -6.047316 -1.032068 -1.114353
C  -6.701969 -1.074924 1.240124
H  0.611388 1.60035 -1.8515
H  1.989848 0.840203 2.287486
H  3.729666 0.499122 2.564491
H  3.117514 2.181185 2.674161
H  5.481102 1.353053 0.823041
H  4.913482 2.135702 -0.689323
H  4.801325 3.000442 0.876961
H  4.860926 -0.927905 0.434107
H  0.58839 -1.171314 -2.194774
H  4.298314 -2.998652 -0.853873
H  2.166359 -3.125613 -2.172688
H  -2.439649 1.635886 1.298559
H  -3.197017 2.563879 -0.062281
H  -2.900095 -0.524087 0.094947
H  -3.599879 0.384902 -1.277031
H  -5.430536 1.255715 0.255363
H  -4.659375 0.407163 1.632455
H  -6.582663 -1.990478 -1.23522
H  -6.738564 -0.207006 -1.428172
H  -5.187451 -1.040906 -1.805002
H  -6.310344 -1.066912 2.272929
H  -7.487138 -0.27938 1.160225
H  -7.189724 -2.051142 1.068414
