program: Gaussian 09
title: 000213290
version: EM64L-G09RevD.01
frameworkgroup: C1[X(C13H12N2O2S2)]
method: RPBEPBE
basis: SDD
operation: Freq
keyword: #p
keyword: freq=noraman
keyword: PBEPBE/SDD
title: #p freq=noraman PBEPBE/SDD
converged: YES YES NO NO
title: Mulliken charges:
elementType: S S O O N N C C C C C C C C C C C C C H H H H H H H H H H H H
charge: 0.254343 0.294813 -0.378272 -0.220670 0.042963 0.058046 -0.193741 0.448072 -0.193201 -0.270271 -0.217016 -0.377531 -0.373368 0.123227 -0.802711 -0.253999 -0.404317 0.111368 -0.826698 0.292952 0.252275 0.235763 0.234761 0.225989 0.228103 0.238735 0.271699 0.245205 0.280430 0.284047 0.389002
chargesum: 0.00000
title: Mulliken charges with hydrogens summed into heavy atoms:
elementType: S S O O N N C C C C C C C C C C C C C
charge: 0.254343 0.294813 0.010730 -0.220670 0.042963 0.058046 -0.193741 0.448072 0.099751 -0.017996 -0.217016 -0.141768 -0.138606 0.123227 -0.109883 0.017700 -0.404317 0.111368 -0.017016
polarizability: 2.95280749e+02 3.12112498e+00 1.65191218e+02 1.30371520e+01 6.73697252e+00 1.59045463e+02
1716.lowfreq: -9.3356 -5.6296 -4.1810 -0.0028 -0.0026 -0.0024 13.0954 22.9291 27.1228
frequency: 12.4633 22.8763 27.1219 31.7639 47.4836 65.3126 93.1563 115.0446 118.3095 120.0976 134.2498 143.0240 227.8304 234.8614 265.1972 290.8816 340.4071 342.4010 354.1208 363.9361 379.5947 397.4416 408.6719 463.3364 495.4508 521.4620 595.3378 601.2551 611.2896 629.3271 658.8556 670.2621 692.5385 712.3329 726.1178 784.8674 802.6568 825.5293 826.7221 855.2372 940.1529 958.2139 977.5853 980.8303 984.8638 987.8894 996.1111 1001.3365 1047.4845 1051.3929 1071.5157 1119.4460 1165.1937 1187.2650 1193.5137 1220.4085 1222.8851 1254.2604 1301.4698 1320.5141 1351.5699 1363.4253 1376.7825 1393.7596 1395.9903 1436.5106 1450.5316 1469.1299 1473.7251 1478.6498 1481.5120 1501.7121 1577.9974 1602.7687 1646.5422 2976.6776 3025.5430 3058.4193 3087.2474 3125.3512 3126.9947 3150.0452 3150.4177 3150.8124 3156.0382 3158.3295 3500.1738
redmass: 1.0410 4.9071 4.2607 5.3058 7.6495 5.4565 3.9795 4.4926 5.5679 2.7798 1.6045 5.0199 5.9027 4.8840 9.9348 5.0232 7.6355 6.0511 5.3917 6.4169 6.3622 4.9854 2.9407 3.6726 5.1041 3.8816 3.9022 5.2714 1.6696 6.8268 7.2322 7.1229 7.4412 3.4295 7.0719 4.9490 8.6666 1.4186 7.4326 1.2445 1.4639 1.3187 10.7935 1.1843 1.4045 1.3589 1.2806 4.5319 1.5782 3.3727 2.8797 1.3253 6.4820 2.1710 1.1224 3.1214 4.5630 9.9870 1.2762 2.2374 1.2047 5.2394 2.4298 3.1325 1.2222 1.0519 1.0568 1.0945 1.0540 6.1709 2.8097 6.6496 6.2798 6.1222 9.8450 1.0387 1.0283 1.0949 1.0999 1.0888 1.0889 1.0967 1.1038 1.0938 1.0968 1.1057 1.0639
irintensity: 0.6000 0.3484 0.4504 0.6366 2.9280 1.7888 0.8502 0.7433 0.4518 1.8508 0.4626 2.1361 2.1655 0.9619 0.7252 0.5945 2.0645 3.0789 1.0904 4.8506 3.7645 10.8636 1.0717 7.9140 12.5684 17.2187 80.6077 2.1050 104.1223 1.1491 4.0669 17.8174 5.9657 2.0849 27.0052 3.3682 12.7155 46.3514 0.7812 3.0264 8.4507 1.6233 48.9015 6.1953 0.5559 1.6773 4.3341 11.7862 25.6558 248.0937 17.6920 11.0292 83.3717 101.8244 6.2377 10.2391 76.7664 6.3999 1.8206 170.1573 10.6676 0.0241 163.1929 5.0071 12.0454 15.8434 25.4129 16.0290 13.2320 64.4999 25.8927 186.0516 0.9335 1.8112 179.7464 35.8440 20.5097 20.4290 16.5379 17.2170 11.1566 11.1115 8.2102 5.9309 12.8860 9.2127 42.3017
temp: 298.150 k
press: 1.00000 atm
elementType: 16 16 8 8 7 7 6 6 6 6 6 6 6 6 6 6 6 6 6 1 1 1 1 1 1 1 1 1 1 1 1
symmnumber: 1
zpe: 584123.4 jmol-1
zpe.correction: 0.222481 hartree
zpe.thermalcorrener: 0.241912 hartree
zpe.thermalcorrenthalpy: 0.242856 hartree
zpe.thermalcorrgfe: 0.169989 hartree
zpe.sumelectzpe: -1557.280285 hartree
zpe.sumelectthermal: -1557.260854 hartree
zpe.sumelectthermalent: -1557.259910 hartree
zpe.sumelectthermalfe: -1557.332778 hartree
dipole: -1.1254 0.9580 1.2929
dipole: 1.9636
quadrupole: -105.0988 -124.5194 -121.8627
quadrupole: 14.3598 6.1168 0.2154
quadrupole: 12.0615 -7.3591 -4.7024 14.3598 6.1168 0.2154
hfenergy: -1557.5027661 hartree
pointgroup: C01 [X(C13H12N2O2S2)]
dipole: -0.4107569 0.3391523 0.5595309 debye
polarizability: 290.5857792|-21.6403253|165.9031629|18.8187269|4.3226748|163.0284885 unknown
InChI: InChI=1S/C13H12N2O2S2/c1-8-3-5-9(6-4-8)19-10-7-14-13(18-2)15-11(10)12(16)17/h3-7,16H,1-2H3
charge 0 multiplicity 1
31 atoms
S  -0.538307 1.352299 -1.313899
S  3.997071 -2.917002 0.035496
O  2.70585 2.428095 0.826555
O  0.761427 1.778073 1.922044
N  2.698426 -0.531566 0.445997
N  1.808175 -2.041879 -1.249135
C  -2.065583 0.588141 -0.574168
C  -4.459834 -0.481331 0.518864
C  -2.189364 0.44347 0.825851
C  -3.12138 0.213197 -1.433468
C  0.726953 0.106092 -0.836315
C  -3.379496 -0.099525 1.357956
C  -4.311621 -0.313926 -0.882015
C  1.697296 0.354469 0.162946
C  -5.748523 -1.028238 1.107195
C  0.83665 -1.133479 -1.52146
C  2.70675 -1.689894 -0.272766
C  1.63759 1.573886 1.05359
C  4.980546 -2.049408 1.385113
H  -1.372404 0.755907 1.485299
H  -3.013465 0.324767 -2.517373
H  -3.471466 -0.219528 2.44424
H  -5.129739 -0.605719 -1.551473
H  -6.259596 -1.708736 0.403794
H  -5.563703 -1.580782 2.045059
H  -6.454766 -0.20846 1.343324
H  0.122776 -1.397538 -2.308532
H  5.813007 -2.73038 1.620984
H  4.34312 -1.887888 2.265194
H  5.353081 -1.085648 1.011943
H  2.661734 3.198331 1.457759
