program: Gaussian 09
title: 000213280
version: EM64L-G09RevD.01
frameworkgroup: C1[X(C8H13N3OS)]
method: RPBEPBE
basis: SDD
operation: Freq
keyword: #p
keyword: freq=noraman
keyword: PBEPBE/SDD
title: #p freq=noraman PBEPBE/SDD
converged: YES YES NO NO
title: Mulliken charges:
elementType: S O N N N C C C C C C C C H H H H H H H H H H H H H
charge: 0.176643 -0.170117 -0.375146 -0.064629 -0.010513 -0.111776 -0.082240 -0.678241 -0.678360 -0.114843 -0.535737 0.232399 -0.655427 0.218343 0.243082 0.216442 0.221745 0.221774 0.216379 0.243163 0.236143 0.234813 0.329964 0.235860 0.213197 0.237084
chargesum: 0.00000
title: Mulliken charges with hydrogens summed into heavy atoms:
elementType: S O N N N C C C C C C C C
charge: 0.176643 -0.170117 -0.045182 -0.064629 -0.010513 0.106567 -0.082240 0.003028 0.002955 -0.114843 -0.064781 0.232399 0.030714
polarizability: 2.00923702e+02 -6.90756845e-01 1.20168946e+02 -2.82468543e-02 -5.33491383e-02 8.05208026e+01
1716.lowfreq: -24.4572 -22.1446 -7.3779 -4.0388 -0.0031 -0.0022 -0.0018 6.1912 20.7511
frequency: -22.9141 -21.5816 15.1365 47.0162 80.4567 108.0877 172.4490 176.4056 212.2777 222.0963 239.7265 244.7155 266.9375 294.6982 341.3549 408.1775 418.5110 531.0966 541.1204 576.0078 577.9982 597.6931 613.5691 640.5226 681.1960 768.5399 803.2823 860.4732 865.3366 924.9814 957.1978 976.9074 991.0640 1024.0491 1064.1559 1077.7905 1096.2710 1109.4664 1125.7129 1151.7636 1179.8584 1252.7529 1289.6006 1323.9957 1340.3306 1375.9648 1392.5027 1399.5804 1442.7029 1462.0678 1464.9515 1466.1203 1467.0633 1470.9808 1476.4530 1478.9638 1494.7529 1508.7815 1670.7595 2968.6584 2986.5991 2988.4450 3003.4205 3008.9871 3018.0163 3083.1073 3087.2617 3097.4462 3100.7164 3104.0487 3109.3100 3542.6639
redmass: 3.8374 5.8172 1.8908 3.7168 4.3633 3.3738 3.4442 1.2439 1.0397 4.1024 3.8830 1.4583 2.3652 4.9567 5.1015 2.8719 6.5039 7.8916 3.0057 2.1939 5.7623 2.3003 4.8965 3.4580 4.8865 7.1918 1.3633 3.7856 4.5411 1.1564 1.4730 4.5295 2.5375 2.4141 2.8398 1.5910 1.9063 2.6026 2.7879 2.9499 2.1156 1.1755 1.3137 1.6973 1.5516 1.1844 1.2180 1.2056 1.1623 1.0444 3.2520 1.5946 1.0435 1.0486 1.0538 1.0535 1.2805 5.5948 6.6721 1.0593 1.0346 1.0353 1.0363 1.0844 1.1000 1.1008 1.1001 1.1014 1.1004 1.1004 1.1004 1.0771
irintensity: 2.9457 1.2945 1.1858 1.8765 1.7652 0.6851 2.1491 0.7982 0.0768 1.8372 2.1791 0.8213 3.3605 1.6053 12.1137 4.4799 0.3711 8.2091 0.1008 26.9098 26.5708 52.1328 11.7294 11.7193 14.1037 0.1780 18.7426 3.1218 2.3144 4.6638 0.1456 48.5726 14.3347 41.6451 94.0271 0.1392 22.5309 1.7142 107.2927 118.5705 11.5419 0.0049 0.1009 17.8068 0.1154 16.2430 12.3880 24.3669 113.5701 6.3155 35.7266 561.5050 20.7077 2.2569 16.3893 10.6193 48.1384 172.6792 126.4329 25.5796 29.4678 33.5369 27.1935 9.3560 12.9994 17.1573 56.1557 5.4862 27.0753 37.9450 27.3430 31.3565
temp: 298.150 k
press: 1.00000 atm
elementType: 16 8 7 7 7 6 6 6 6 6 6 6 6 1 1 1 1 1 1 1 1 1 1 1 1 1
symmnumber: 1
zpe: 537488.8 jmol-1
zpe.correction: 0.204719 hartree
zpe.thermalcorrener: 0.218019 hartree
zpe.thermalcorrenthalpy: 0.218963 hartree
zpe.thermalcorrgfe: 0.163263 hartree
zpe.sumelectzpe: -949.163426 hartree
zpe.sumelectthermal: -949.150125 hartree
zpe.sumelectthermalent: -949.149181 hartree
zpe.sumelectthermalfe: -949.204882 hartree
dipole: -0.0438 6.0130 -0.0136
dipole: 6.0132
quadrupole: -66.4215 -92.2671 -85.0893
quadrupole: 9.0315 -0.0239 0.0070
quadrupole: 14.8378 -11.0078 -3.8300 9.0315 -0.0239 0.0070
hfenergy: -949.3681446 hartree
pointgroup: C01 [X(C8H13N3O1S1)]
dipole: 0.0064562 -2.365753 0.0047952 debye
dipolederiv: -0.5968381 0.0534525 0.0003537 -0.1045593 -0.6045547 0.0008727 0.0004286 0.0006814 0.0680649 -0.6507166 0.0027859 -0.0000099 -0.6233046 -0.8004122 0.0000148 -0.0015898 0.0003646 -0.275921 -2.4186091 -0.2187741 -0.0007995 -0.3914665 -0.4059563 -0.0005507 -0.0015078 -0.000111 -0.3275004 -0.2083948 0.1621381 -0.0004458 -0.1547 -0.4564628 0.0003664 0.0008912 0.0007169 -0.157065 -0.4199287 -0.149349 0.0002951 0.4269284 -0.4412253 0.0005343 -0.0009728 0.0006731 -0.1496047 0.0490664 -0.0021985 -0.0000182 0.2386056 0.0979948 -0.0005219 -0.0019206 -0.000366 0.0871521 0.649155 -0.2323939 -0.0003957 -0.307911 0.6687066 -0.0005525 0.0006949 -0.0009092 -0.0852558 -0.0558052 0.0237343 -0.0271343 -0.060623 0.0441016 0.0202624 0.1024839 0.0270066 -0.0088357 -0.0554663 0.0239555 0.0269663 -0.0616012 0.0436045 -0.0207007 -0.1015798 -0.027565 -0.0082421 1.698002 0.1637468 0.0000423 -0.2420135 0.6613305 -0.0016144 -0.0005194 -0.0013453 0.0771689 -0.2494962 0.072129 -0.00031 0.2365242 -0.0921918 0.0030549 -0.0061609 0.0041941 0.159369 2.0406076 0.1895594 0.0027019 1.1204911 1.1023628 -0.0000679 0.0067869 -0.0012493 0.1851858 -0.0014452 -0.0519492 0.0008217 -0.0054279 0.0413664 -0.0004558 0.0011057 -0.0014172 0.0565778 0.0443771 0.0353909 -0.000092 -0.0202837 -0.1309288 0.000886 0.0002004 0.0006846 0.0416485 0.1115658 -0.0624837 -0.0078107 -0.0156138 -0.0906656 0.0291255 -0.0049499 -0.0286483 0.0819482 -0.2316885 -0.0214024 -0.0313927 -0.0088956 0.0911814 0.0183498 -0.0355125 0.0215813 0.0754128 0.0895546 0.0524497 0.0889226 0.0340225 0.0405467 -0.0905872 0.0571837 -0.0588361 -0.1077089 0.0893702 0.0516761 -0.0895834 0.0336268 0.041917 0.0891017 -0.0575593 0.0575254 -0.1089443 -0.2315079 -0.0210664 0.0318906 -0.0086171 0.090848 -0.0184364 0.0357162 -0.0216773 0.0757034 0.1117892 -0.062412 0.0082472 -0.0156265 -0.0905032 -0.0274009 0.0050516 0.0303033 0.0819629 -0.0071042 -0.0269 0.0429131 -0.029524 0.0016405 0.1025019 0.0284527 0.1236118 -0.0386531 -0.0069443 -0.0300932 -0.043521 -0.0321617 -0.0056255 -0.1042555 -0.0274186 -0.1256378 -0.0325576 0.1945701 -0.0432374 -0.0001191 -0.0378945 0.1404065 -0.0000285 0.0003348 -0.0002933 0.310857 0.1017765 0.0009965 -0.0204661 -0.0555912 0.0251769 0.1022489 0.0111531 0.0986643 -0.0586303 -0.1506629 0.0882493 -0.0013066 0.1419437 0.0082601 0.00196 -0.0019537 0.0020189 0.1076509 0.1047732 0.0019959 0.0202505 -0.0563272 0.0190819 -0.1041067 -0.0088386 -0.0999704 -0.0497831 unknown
polarizability: 200.9017577|1.4997356|120.1909191|-0.0106145|-0.0442878|80.5207739 unknown
InChI: InChI=1S/C8H13N3OS/c1-4-6(12)9-8-11-10-7(13-8)5(2)3/h5,9H,4H2,1-3H3
charge 0 multiplicity 1
26 atoms
S  -1.010555 -1.693598 -0.000802
O  2.761852 1.298156 -0.001215
N  1.642843 -0.780106 -0.002906
N  -1.559802 0.920657 -0.004563
N  -0.156397 0.864139 -0.005745
C  -3.675962 -0.440083 0.00035
C  -2.174761 -0.251986 -0.001436
C  -4.295198 0.176305 -1.283757
C  -4.293713 0.188304 1.279329
C  0.305621 -0.382798 -0.003358
C  4.098614 -0.781088 0.003813
C  2.803276 0.048866 -0.000772
C  5.354879 0.106474 -0.012886
H  -3.887645 -1.52632 0.005507
H  -4.08366 1.258371 -1.324803
H  -5.390149 0.027924 -1.282094
H  -3.881778 -0.290807 -2.195254
H  -3.879369 -0.270403 2.19466
H  -5.388697 0.040146 1.280205
H  -4.081889 1.270653 1.310156
H  4.101133 -1.432729 0.901749
H  4.094237 -1.457541 -0.875469
H  1.813038 -1.787908 -0.002866
H  5.37257 0.744617 -0.912174
H  6.266982 -0.515741 -0.0022
H  5.372831 0.776195 0.863033
