program: Gaussian 09
title: 000213282
version: EM64L-G09RevD.01
frameworkgroup: C1[X(C9H8Cl2N2O)]
method: RPBEPBE
basis: SDD
operation: Freq
keyword: #p
keyword: freq=noraman
keyword: PBEPBE/SDD
title: #p freq=noraman PBEPBE/SDD
converged: YES YES NO NO
title: Mulliken charges:
elementType: Cl Cl O N N C C C C C C C C C H H H H H H H H
charge: -0.054893 -0.036801 -0.207400 0.052186 -0.364490 0.552968 -0.282769 -0.343980 -0.216169 -0.217429 -0.090825 -0.370675 0.252115 -0.787003 0.296930 0.283353 0.263513 0.230889 0.291646 0.238760 0.270967 0.239108
chargesum: 0.00000
title: Mulliken charges with hydrogens summed into heavy atoms:
elementType: Cl Cl O N N C C C C C C C C C
charge: -0.054893 -0.036801 -0.207400 0.052186 -0.072845 0.552968 -0.282769 -0.047050 0.067184 0.046084 -0.090825 -0.139786 0.252115 -0.038167
polarizability: 2.72590139e+02 -4.28008895e+00 1.48054523e+02 1.19857947e-02 3.03764667e-02 5.52519956e+01
1716.lowfreq: -86.7702 -4.0408 0.0014 0.0023 0.0028 3.7908 7.0209 43.8378 47.7843
frequency: -86.7514 43.8312 47.7817 54.4603 108.0474 163.2061 165.0121 176.8027 193.1513 235.6591 248.8045 331.4860 366.5134 371.8028 396.7158 450.0886 458.8917 523.5797 550.4037 570.8731 635.2762 638.2773 653.2187 716.1823 724.9385 835.2691 841.5417 864.5331 940.2434 946.0262 960.3382 987.9663 1020.3205 1030.7211 1079.7649 1099.4815 1139.1701 1207.9532 1226.4338 1271.7321 1324.2083 1359.3038 1375.5382 1392.4927 1446.4710 1457.5509 1467.7217 1504.8057 1548.7692 1580.1061 1594.0293 1660.6290 2988.9042 3014.2089 3074.3873 3136.4826 3158.2528 3180.8880 3187.0846 3365.7911
redmass: 1.0632 6.6779 4.7333 7.3091 4.8952 5.7628 15.0688 9.0693 4.1160 6.8370 3.7323 7.3664 4.7302 12.7466 4.7235 5.5928 3.5597 5.4135 3.9269 3.2283 1.1969 5.9293 6.5371 3.9774 7.7423 5.0980 1.3538 1.4009 1.5152 1.9162 4.3597 1.3578 3.9505 1.6700 2.3492 5.6079 1.4090 2.7218 1.6885 1.5354 1.8855 2.8915 1.2319 5.3287 1.2063 2.0593 1.0470 1.7764 8.4515 6.0544 7.1218 7.3136 1.0383 1.0877 1.0984 1.0979 1.0895 1.0965 1.0938 1.0755
irintensity: 0.0908 10.0879 6.5624 5.5828 0.3533 0.0723 0.2298 3.5675 6.3762 0.7519 18.0974 7.9506 1.8261 5.5526 13.1638 5.1081 7.7187 1.1435 2.7586 9.5080 84.0498 26.2791 6.4957 0.1764 44.4747 20.9775 31.2088 19.6171 37.7477 19.0082 26.4180 3.8234 72.8280 7.7732 79.2006 67.2632 19.8462 348.4440 134.5847 12.8031 37.3848 3.4246 56.7774 24.0642 96.2858 83.8388 21.3922 187.2323 29.7222 20.0174 79.3674 239.7699 6.1150 40.0067 14.8769 8.4426 0.2895 1.6196 0.5370 5.9866
temp: 298.150 k
press: 1.00000 atm
elementType: 17 17 8 7 7 6 6 6 6 6 6 6 6 6 1 1 1 1 1 1 1 1
symmnumber: 1
zpe: 401312.0 jmol-1
zpe.correction: 0.152852 hartree
zpe.thermalcorrener: 0.166038 hartree
zpe.thermalcorrenthalpy: 0.166983 hartree
zpe.thermalcorrgfe: 0.111075 hartree
zpe.sumelectzpe: -1451.569418 hartree
zpe.sumelectthermal: -1451.556231 hartree
zpe.sumelectthermalent: -1451.555287 hartree
zpe.sumelectthermalfe: -1451.611195 hartree
dipole: -2.0132 3.7593 0.0074
dipole: 4.2644
quadrupole: -86.8689 -98.4981 -97.3242
quadrupole: -17.5322 -0.0315 0.0073
quadrupole: 7.3615 -4.2677 -3.0938 -17.5322 -0.0315 0.0073
hfenergy: -1451.7222692 hartree
pointgroup: C01 [X(C9H8Cl2N2O1)]
dipole: -0.7426311 1.5035539 0.0514131 debye
dipolederiv: -0.1214903 0.0860508 0.0026685 -0.0105234 -0.7757612 -0.0235241 -0.0004535 -0.0233302 -0.0641946 -0.9449292 0.2697619 0.0070421 0.3012111 -0.2223789 -0.0049471 0.0078102 -0.0049702 -0.0550563 -0.6611704 0.0191617 0.0004631 -0.7786902 -0.9666401 -0.022583 -0.0259058 -0.0218534 -0.3192762 1.0063441 0.1574693 0.0057892 -0.5557737 -0.2757086 -0.007388 -0.0209288 -0.0066781 -0.0822368 -2.2245573 -0.514017 -0.0193031 -0.0544856 -0.1742067 0.0054718 -0.0012301 0.0053133 -0.3276912 0.1324659 0.0295817 0.0009852 0.0001902 -0.398894 -0.0146849 -0.0004681 -0.0149367 0.0417606 0.2232132 -0.1735444 -0.0048135 0.1219751 1.1561014 0.0411606 0.0043319 0.0406906 -0.0874 -0.0132941 -0.0542726 -0.0013356 -0.0581593 0.0671361 0.0058482 -0.0018991 0.0058634 -0.1098804 -0.3292476 0.196924 0.0059316 0.3001133 -0.3867829 -0.0103202 0.0095584 -0.0104618 -0.0545105 -0.4344496 0.040682 0.0006073 -0.0165719 0.0123442 0.0040556 -0.0013333 0.0041299 -0.1074916 1.2490892 -0.3541514 -0.0087399 -0.4124402 0.3753393 0.0139566 -0.0104423 0.0140102 -0.0691104 0.0260993 -0.047136 -0.0005856 -0.5309333 0.313293 0.0143669 -0.0145317 0.015324 -0.1025473 2.2284554 0.284523 0.0103618 1.3137265 1.3182549 0.0396306 0.0432576 0.0385516 0.1803488 -0.4629636 0.1255315 0.0041749 0.2725133 -0.1368848 -0.0072983 0.0108551 -0.0074451 0.0620967 0.0636032 -0.0501801 -0.0019599 -0.036849 0.0566648 -0.0034224 -0.0013985 -0.0035339 0.1565508 0.046557 -0.0401538 -0.0016455 -0.0447564 0.0695475 -0.0036164 -0.0017687 -0.0035891 0.1735237 0.0799127 0.0321815 0.0008953 0.0389047 -0.0216387 -0.0063166 0.0011361 -0.006274 0.1681035 0.0115638 0.0579992 0.0017713 0.1230151 -0.0944398 -0.0100227 0.0036113 -0.0103836 0.1933629 0.009404 -0.009894 -0.0003614 0.0914613 -0.0157419 -0.0115794 0.0027403 -0.0117683 0.327494 0.0657272 -0.0018183 0.0343455 0.0293002 0.0259823 0.1090202 -0.0117015 0.1102405 -0.0208747 -0.0158702 -0.0557332 -0.0023819 -0.1218768 0.032227 -0.0039416 -0.005101 -0.0036948 0.1337698 0.0655371 0.001034 -0.0339094 0.028649 0.042187 -0.103866 0.0138615 -0.1052042 -0.0367408 unknown
polarizability: 272.1696198|-8.3998366|148.3720755|0.0569011|3.0888106|55.354962 unknown
InChI: InChI=1S/C9H8Cl2N2O/c1-6(14)13-12-5-7-2-3-8(10)4-9(7)11/h2-5,13H,1H3
charge 0 multiplicity 1
22 atoms
Cl 1.604693 2.986319 0.102959
Cl 5.077787 -1.316785 -0.031888
O  -3.988571 -1.642356 -0.058054
N  -1.668743 -0.051034 -0.005088
N  -2.94579 0.462591 0.012493
C  0.714575 0.302046 0.011593
C  1.837884 1.170227 0.043546
C  0.984027 -1.099478 -0.034828
C  3.165343 0.703186 0.031188
C  2.295918 -1.6016 -0.048604
C  3.371899 -0.688184 -0.015096
C  -0.664754 0.801837 0.025015
C  -4.074185 -0.392555 -0.016097
C  -5.392218 0.381069 0.010501
H  0.12435 -1.776315 -0.059987
H  4.005952 1.399928 0.056626
H  2.483183 -2.677996 -0.084406
H  -0.805049 1.898052 0.064079
H  -3.101965 1.482873 0.046947
H  -5.482745 1.056331 -0.860459
H  -6.218841 -0.342996 -0.017601
H  -5.485053 0.98934 0.929259
