program: Gaussian 09
title: 000213279
version: EM64L-G09RevD.01
frameworkgroup: C1[X(C8H13N3OS)]
method: RPBEPBE
basis: SDD
operation: Freq
keyword: #p
keyword: freq=noraman
keyword: PBEPBE/SDD
title: #p freq=noraman PBEPBE/SDD
converged: YES YES NO NO
title: Mulliken charges:
elementType: S O N N N C C C C C C C C H H H H H H H H H H H H H
charge: 0.308732 -0.227820 -0.360690 -0.053209 -0.100514 -0.423753 -0.345414 -0.119094 -0.677729 -0.128694 -0.509724 0.250358 -0.660665 0.241262 0.220831 0.207099 0.223290 0.225156 0.215232 0.211613 0.219621 0.249458 0.339436 0.253001 0.219287 0.222931
chargesum: 0.00000
title: Mulliken charges with hydrogens summed into heavy atoms:
elementType: S O N N N C C C C C C C C
charge: 0.308732 -0.227820 -0.021254 -0.053209 -0.100514 0.038339 0.084975 -0.119094 -0.025727 -0.128694 -0.040644 0.250358 0.034555
polarizability: 1.98587152e+02 -3.87336085e+00 1.22732139e+02 7.08275728e+00 4.46435266e+00 7.87744143e+01
1716.lowfreq: -11.7067 -6.0063 -0.0019 -0.0016 0.0008 1.9430 23.3800 34.0491 50.3564
frequency: 21.5781 33.8629 50.2670 73.2016 83.9472 100.8759 124.0780 187.4420 210.5983 230.6109 260.2851 271.3560 290.1320 326.3901 364.1473 413.1033 522.7168 537.8419 573.8832 582.6937 604.5019 636.8691 677.4285 687.4883 746.2373 780.9635 799.9904 863.8971 886.2739 895.0482 981.5265 1025.3228 1045.9225 1061.1693 1079.9165 1082.3087 1093.8018 1131.5198 1162.1065 1232.2222 1249.5068 1268.2439 1278.1061 1291.2230 1339.9989 1340.5477 1392.6642 1394.0925 1396.4599 1444.1060 1447.8773 1463.7705 1471.7654 1474.1989 1478.0433 1485.5891 1486.0328 1505.3798 1624.6862 2977.0519 2979.2936 2983.7952 2991.9183 2999.8598 3033.7787 3035.8393 3062.4947 3079.0859 3079.6502 3096.1562 3109.1020 3521.7538
redmass: 2.4558 4.2044 3.0337 6.5585 2.0604 3.4017 3.4835 1.2876 3.4121 1.1270 3.1896 4.5369 3.9094 4.0145 5.5398 6.5735 4.0943 5.2527 4.9233 5.4042 10.4746 5.1886 1.6865 2.4195 1.1252 4.5402 1.5311 1.4849 2.4365 2.4887 3.6317 2.3452 3.6253 1.9107 1.8595 2.2007 2.1673 2.6749 2.4886 1.4101 1.3856 2.3056 1.3244 1.1702 1.4624 1.6394 1.2114 1.5491 1.7636 1.1045 1.2040 3.8164 1.0572 1.0609 1.0522 1.0559 1.0774 3.9346 6.4496 1.0359 1.0598 1.0613 1.0623 1.0360 1.1000 1.0985 1.0998 1.1016 1.0996 1.1008 1.1004 1.0765
irintensity: 0.0740 1.3853 2.0234 7.5432 2.6778 4.0338 3.7065 2.9693 5.5703 0.4554 1.8756 3.3625 16.5046 1.5550 0.1005 3.5932 10.4884 11.5740 4.2253 5.3200 4.9870 2.3155 55.1054 39.2440 6.7975 3.6081 13.6065 5.7950 10.3909 17.9476 18.0479 0.1011 2.7423 17.6864 7.4195 2.0239 19.0533 8.2577 80.6892 20.0408 14.2465 74.7663 1.4964 5.3011 1.4945 42.0115 10.3068 3.4433 35.6672 15.6240 14.6287 120.4422 17.0074 7.7280 9.2796 22.7299 17.2155 406.5350 84.9992 37.8385 18.4894 3.0494 41.9748 30.5884 14.7859 1.9896 0.7228 68.5728 41.7995 34.5071 20.8177 40.1591
temp: 298.150 k
press: 1.00000 atm
elementType: 16 8 7 7 7 6 6 6 6 6 6 6 6 1 1 1 1 1 1 1 1 1 1 1 1 1
symmnumber: 1
zpe: 541403.5 jmol-1
zpe.correction: 0.206210 hartree
zpe.thermalcorrener: 0.220782 hartree
zpe.thermalcorrenthalpy: 0.221726 hartree
zpe.thermalcorrgfe: 0.162289 hartree
zpe.sumelectzpe: -949.176740 hartree
zpe.sumelectthermal: -949.162167 hartree
zpe.sumelectthermalent: -949.161223 hartree
zpe.sumelectthermalfe: -949.220661 hartree
dipole: 1.7210 -0.5366 0.4653
dipole: 1.8618
quadrupole: -61.9095 -97.6531 -84.5733
quadrupole: 12.1935 3.6303 -0.1405
quadrupole: 19.4691 -16.2744 -3.1947 12.1935 3.6303 -0.1405
hfenergy: -949.3829497 hartree
pointgroup: C01 [X(C8H13N3O1S1)]
dipole: 0.6820529 -0.1557203 -0.2170066 debye
dipolederiv: -0.0641546 0.025875 -0.0696835 0.0527551 0.1454813 0.0335547 -0.1828574 0.0355348 -0.3203741 -0.7180177 0.0157699 -0.0929079 0.0165825 -0.3191568 0.0377872 0.4197895 0.0203187 -0.8471169 -1.6980003 0.0107089 0.4814521 0.0671898 -0.3021853 -0.0146859 0.5542324 -0.0091683 -0.6154087 -0.2311081 -0.0173728 0.2374785 0.0136854 -0.1635497 -0.0071494 -0.1428793 0.0021933 -0.3458147 -0.4994446 -0.0076919 -0.1980731 0.0184446 -0.1789146 0.0303595 0.3287331 0.0026965 -0.4304992 -0.1104394 -0.0278722 -0.0834685 -0.1234439 0.095089 -0.0632256 -0.0995154 -0.0645719 0.0238869 0.0241514 0.0346019 -0.005097 0.1933367 0.1253156 0.0031335 0.0500588 -0.0060393 0.1405309 0.6242948 0.0110053 -0.0877726 -0.0835302 -0.1132199 -0.046755 -0.1104219 -0.0248428 0.4050734 -0.0453861 -0.0082961 -0.0479295 -0.0972747 0.0583117 -0.0324112 -0.0924419 -0.0266771 0.0750232 1.3280051 -0.0561167 -0.0672841 -0.0960489 0.0730349 -0.0221571 0.168141 -0.0476608 0.499579 -0.3182133 0.0280403 0.0230491 0.1567363 0.0867769 0.0551262 -0.0058635 0.0671873 0.0672478 1.436212 -0.0681297 -0.2187823 -0.1478389 0.1950061 -0.0383603 -0.9467599 -0.014848 1.2423049 0.0322407 -0.0203394 0.0203996 0.0004989 0.0663573 0.0082816 -0.0709525 0.0215355 0.0057313 -0.0260299 0.0140314 0.0587069 -0.0052103 0.0854608 -0.013958 0.0914814 -0.0398687 -0.0349979 0.0092471 0.0089906 -0.0126515 0.0381454 -0.0616299 0.064508 -0.0483558 0.1152886 0.0330639 -0.0508393 0.0107481 0.1100597 -0.0101435 0.0582247 -0.007896 0.1138277 -0.0441823 -0.0581612 0.0506218 0.0282994 -0.0462608 0.0183164 -0.0964497 0.0698553 -0.0334966 0.1093174 0.0016857 -0.014258 -0.0633925 -0.0587297 -0.1007828 -0.0689409 -0.1170311 -0.0977855 -0.1122182 0.0202991 -0.0201979 0.0149016 0.0763851 0.0449159 0.0953237 -0.0174846 0.157186 -0.0172597 -0.0870986 0.0561527 0.003221 -0.0076341 0.0718627 -0.0890212 0.137974 -0.0334115 0.1163111 0.0105065 0.0145794 -0.0044516 0.023813 -0.0430944 0.0831435 -0.0564362 -0.0186378 -0.0397333 -0.158244 0.0114063 0.0041952 0.0088505 0.0033892 -0.1055625 0.0182034 0.010796 -0.0074034 0.0924622 0.1740711 0.0130741 0.0095939 0.0068738 0.3221993 0.0040278 -0.0083177 0.0052231 0.1843794 0.1450377 -0.025089 -0.0787296 -0.026171 0.077923 -0.0465372 -0.017059 -0.0367922 -0.0711786 -0.2080404 0.0333047 0.0067455 0.0506742 0.0815259 0.0224528 -0.0198389 0.0249128 0.093368 0.0981092 0.0419845 0.0184703 -0.0198688 -0.1505429 -0.0011762 0.034349 -0.0292531 0.0737515 unknown
polarizability: 198.7547749|0.4220702|77.8887071|-5.6256524|-0.9797505|123.4502233 unknown
InChI: InChI=1S/C8H13N3OS/c1-3-5-7-10-11-8(13-7)9-6(12)4-2/h9H,3-5H2,1-2H3
charge 0 multiplicity 1
26 atoms
S  -0.613148 0.574448 -0.531994
O  2.122825 0.433065 -1.419824
N  1.836189 0.331385 0.887641
N  -1.590047 0.497044 1.970662
N  -0.190012 0.395393 2.114014
C  -3.427813 0.698372 0.278229
C  -3.919933 -0.526656 -0.543653
C  -1.994042 0.595317 0.707615
C  -5.402358 -0.384604 -0.946009
C  0.44516 0.420254 0.936405
C  4.130303 0.155406 -0.012327
C  2.632999 0.327511 -0.269452
C  4.985328 0.904057 -1.055718
H  -4.036243 0.798236 1.195494
H  -3.57971 1.618961 -0.31958
H  -3.293769 -0.63978 -1.450247
H  -3.774618 -1.443342 0.058598
H  -5.744782 -1.266198 -1.517057
H  -6.049702 -0.287415 -0.054478
H  -5.560788 0.509937 -1.57726
H  4.388915 0.479648 1.014089
H  4.350242 -0.930226 -0.067121
H  2.280208 0.255367 1.807683
H  4.678522 0.615996 -2.074759
H  6.054398 0.662676 -0.924772
H  4.861573 1.997147 -0.96298
