program: Gaussian 09
title: 000213345
version: EM64L-G09RevD.01
frameworkgroup: C1[X(C22H27F3N3S)]
method: RPBEPBE
basis: SDD
operation: Freq
keyword: #p
keyword: freq=noraman
keyword: PBEPBE/SDD
title: #p freq=noraman PBEPBE/SDD
converged: YES YES NO NO
title: Mulliken charges:
elementType: S F F F N N N C C C C C C C C C C C C C C C C C C C C C C H H H H H H H H H H H H H H H H H H H H H H H H H H H
charge: 0.269418 -0.134489 -0.221877 -0.194904 -0.095901 -0.080618 -0.243812 -0.385928 -0.366124 -0.412117 -0.409466 -0.558753 -0.549394 -0.355589 -0.399725 -0.498477 0.569739 0.513367 -0.387868 -0.341582 -0.475733 -0.311935 0.346821 -0.249273 -0.264112 -0.412840 -0.253244 -0.240694 0.224000 0.260251 0.317088 0.299091 0.257071 0.267193 0.218341 0.213795 0.263903 0.263307 0.269087 0.264149 0.297099 0.256363 0.258971 0.223268 0.213899 0.235108 0.242361 0.244129 0.262932 0.282083 0.230857 0.263763 0.254643 0.275772 0.238430 0.248156
chargesum: 1.00000
title: Mulliken charges with hydrogens summed into heavy atoms:
elementType: S F F F N N N C C C C C C C C C C C C C C C C C C C C C C
charge: 0.269418 -0.134489 -0.221877 -0.194904 -0.095901 -0.080618 -0.243812 0.191411 0.190038 0.073417 0.068232 0.237790 0.263039 0.081578 0.077744 0.008585 0.569739 0.513367 -0.387868 -0.341582 -0.193650 -0.081078 0.346821 0.014490 -0.009469 -0.137068 -0.014815 0.007461 0.224000
polarizability: 3.90230173e+02 -3.99020425e+01 3.09150174e+02 2.13031718e+00 -7.59110992e+00 1.61079620e+02
1716.lowfreq: -4.8470 -0.0016 -0.0015 -0.0012 0.9572 3.4861 13.8207 29.5207 44.1279
frequency: 13.7653 29.5076 44.1109 56.8796 62.9614 66.5414 70.4038 77.4375 90.6681 121.6479 126.0471 162.5667 173.8567 191.6316 201.0114 226.1597 236.0222 240.2652 247.6228 255.2516 260.8392 293.2790 317.7159 328.9524 334.9815 340.2834 358.4935 366.3973 383.4479 394.6141 416.2282 423.8799 433.2426 434.1516 446.6767 450.8832 461.5032 467.7314 486.4349 495.5869 496.2315 531.5258 540.1386 596.0701 602.7287 617.1192 621.0486 653.7958 666.8059 681.8003 696.2909 712.5358 723.6564 725.9632 754.1136 777.7323 792.8815 797.8471 818.3451 846.6185 850.2825 872.8522 885.8599 887.3500 890.5141 899.1075 933.0489 947.0027 952.1263 971.9932 979.6572 987.8277 996.3533 1025.7977 1026.9515 1032.0016 1037.1660 1044.2053 1050.9160 1058.7214 1071.1768 1077.7564 1091.6625 1101.7215 1105.4567 1120.3556 1137.1391 1152.3867 1161.2527 1178.4962 1182.9364 1185.8088 1206.2611 1210.4535 1217.1065 1243.3568 1254.7154 1271.9055 1282.6969 1285.8138 1296.7856 1304.4909 1307.1946 1320.1866 1325.9024 1341.2017 1352.1062 1360.6809 1370.2527 1374.5194 1375.7029 1384.2919 1396.1633 1400.0555 1417.7441 1425.9334 1431.8823 1442.1677 1450.4920 1452.6883 1460.8574 1466.2621 1471.7062 1474.5129 1475.5872 1478.5229 1482.9736 1487.4761 1492.5834 1498.3317 1502.9516 1571.4695 1576.3723 1592.5026 1610.7667 2863.9338 2873.7009 2929.8546 2995.4422 3009.3629 3022.1579 3026.6617 3029.7197 3036.4160 3041.7890 3046.4614 3049.2289 3053.8117 3070.7265 3117.1479 3132.2542 3136.9335 3141.5652 3142.3669 3147.5006 3149.3932 3149.5591 3154.3444 3157.1842 3173.4664 3183.7433 3186.2241
redmass: 5.0317 5.7431 4.3052 7.2216 5.0320 4.9821 5.8494 5.2388 4.5163 6.4677 4.8687 1.1275 4.8765 3.6142 3.5112 3.2661 4.4040 1.4625 6.4641 2.0630 6.4493 1.8898 3.2738 2.8438 5.7620 2.9818 6.4101 2.0749 4.8354 4.1688 4.2272 3.2808 2.5221 2.2355 4.1852 3.4651 3.7374 4.5970 5.4305 5.6015 3.4805 5.9298 4.5203 2.3796 6.4145 8.0565 6.7716 6.2801 6.1387 3.6839 5.3693 2.4327 2.9741 3.6278 1.3629 5.1596 1.8541 1.6325 1.4062 1.4345 2.0661 1.6919 2.0613 3.9701 3.2060 4.1898 1.3701 2.4496 1.3818 3.2332 1.3363 3.9719 2.0620 6.5241 2.1813 2.4114 2.9177 2.2242 2.8902 2.2077 1.7507 2.3865 3.0462 2.5203 1.5380 2.2717 1.6950 2.2960 1.4195 2.1200 1.0750 1.4335 1.1735 1.6462 1.4757 2.4421 1.5259 1.5925 1.7879 1.5044 1.5136 1.7233 1.3919 1.3838 1.3139 1.3079 1.7711 1.3228 1.3523 4.5930 1.4033 1.2862 8.6519 1.3602 3.5477 1.1726 2.3633 1.1277 1.0841 1.0789 1.0671 1.1154 2.3410 1.0829 1.0724 1.0774 1.0886 1.0843 2.3220 1.0562 1.1707 6.1316 6.5136 6.3129 6.7991 1.0724 1.0708 1.0678 1.0608 1.0665 1.0324 1.0885 1.0342 1.0610 1.0715 1.1008 1.0788 1.0860 1.1032 1.1077 1.1046 1.1054 1.1049 1.0870 1.0926 1.1050 1.0909 1.0901 1.1036 1.0954 1.0963 1.0963
irintensity: 1.6859 0.2666 1.0952 1.7712 2.9809 1.9645 2.0363 5.7752 0.9505 2.1326 2.3263 0.0168 0.4979 1.0265 3.7037 9.8421 1.6310 0.5962 1.1143 1.0273 0.7315 0.4216 2.8279 1.5070 2.6112 2.6135 2.7329 3.8256 2.5433 11.9004 2.5166 1.7330 1.1036 1.2356 2.4898 8.9783 6.5773 17.6726 2.3956 7.5670 2.7000 1.9192 0.9934 0.2741 0.0820 4.7995 4.7492 2.9426 6.2507 0.7168 3.5373 5.4797 6.0641 2.7974 92.6904 5.5239 0.4703 19.0747 106.3471 0.3453 7.3838 86.5449 3.7986 89.4195 3.1701 177.3335 1.7000 19.9473 2.4742 48.2442 2.0836 301.1048 21.8039 16.5512 0.9905 12.5581 13.5999 3.6916 13.4653 16.6418 0.7651 33.1610 72.7901 77.4387 27.1258 8.0695 18.1700 18.9756 4.4410 3.2198 0.5702 14.9224 17.1983 1.2396 28.8098 183.3710 19.8215 26.7953 106.7635 57.3811 3.3229 211.9481 36.1486 3.9665 19.0767 45.0254 80.3034 2.7063 17.0869 5.8240 3.7575 8.3080 14.6747 2.7712 186.0059 12.6913 37.7525 6.4886 9.5877 15.0870 4.4265 7.7235 237.7849 4.0632 23.0430 33.2337 62.5779 9.2981 21.4922 36.2982 16.3442 26.2888 18.1894 20.3154 53.4467 38.7334 167.6638 73.0738 20.3713 8.5711 7.3752 29.2684 4.6367 8.5989 23.0312 0.4548 16.6404 5.6282 35.7958 2.4648 5.1046 0.4981 7.3663 0.4547 5.6395 1.7911 5.7304 1.6793 3.8493 18.4107 0.2978 12.4983
temp: 298.150 k
press: 1.00000 atm
elementType: 16 9 9 9 7 7 7 6 6 6 6 6 6 6 6 6 6 6 6 6 6 6 6 6 6 6 6 6 6 1 1 1 1 1 1 1 1 1 1 1 1 1 1 1 1 1 1 1 1 1 1 1 1 1 1 1
symmnumber: 1
zpe: 1198092.3 jmol-1
zpe.correction: 0.456329 hartree
zpe.thermalcorrener: 0.483203 hartree
zpe.thermalcorrenthalpy: 0.484147 hartree
zpe.thermalcorrgfe: 0.399062 hartree
zpe.sumelectzpe: -1713.984942 hartree
zpe.sumelectthermal: -1713.958068 hartree
zpe.sumelectthermalent: -1713.957124 hartree
zpe.sumelectthermalfe: -1714.042209 hartree
dipole: -15.2229 -7.4614 -0.4648
dipole: 16.9595
quadrupole: -58.0710 -147.1413 -174.4876
quadrupole: 19.5335 5.7221 -0.6318
quadrupole: 68.4956 -20.5747 -47.9210 19.5335 5.7221 -0.6318
hfenergy: -1714.4412712 hartree
pointgroup: C01 [X(C22H27F3N3S1)]
dipole: -6.5828151 -0.8057541 0.7336092 debye
polarizability: 333.6078617|57.0388363|339.9940024|4.5648801|66.1593628|186.8581018 unknown
InChI: InChI=1S/C22H27F3N3S/c1-28(2)14-12-26(13-15-28)10-5-11-27-18-6-3-4-7-20(18)29-21-9-8-17(16-19(21)27)22(23,24)25/h3-4,6-9,16H,5,10-15H2,1-2H3
charge 1 multiplicity 1
56 atoms
S  4.185237 0.737085 0.219304
F  -0.182493 -3.855398 -2.246772
F  -1.428396 -2.968756 -0.562076
F  -1.420939 -1.987428 -2.595304
N  -4.884344 -1.775985 -0.236122
N  -3.179923 0.525115 0.526518
N  1.137149 1.417001 0.668573
C  -4.180869 -0.867871 -1.274083
C  -4.112224 -1.680873 1.102287
C  -3.936364 0.550695 -0.744311
C  -3.921161 -0.228107 1.55891
C  -6.342842 -1.372829 -0.055573
C  -4.830417 -3.220415 -0.733162
C  -2.712199 1.884035 0.942403
C  -1.306239 2.203886 0.384983
C  -0.20391 1.557413 1.275332
C  1.403239 0.251367 -0.098444
C  2.039638 2.531652 0.739029
C  2.738309 -0.145197 -0.435279
C  3.43202 2.387062 0.492391
C  0.347562 -0.595746 -0.527176
C  1.57124 3.832588 1.07011
C  0.617195 -1.790816 -1.242387
C  2.986225 -1.310462 -1.188352
C  4.307777 3.488717 0.538981
C  1.933714 -2.155604 -1.5910
C  2.452304 4.932224 1.156138
C  3.825241 4.771401 0.881459
C  -0.527152 -2.638154 -1.66032
H  -4.816138 -0.85594 -2.176427
H  -3.223549 -1.353472 -1.51222
H  -3.128174 -2.141641 0.918401
H  -4.67373 -2.274208 1.843901
H  -3.340721 1.074498 -1.513403
H  -4.896149 1.118523 -0.648659
H  -4.899728 0.242537 1.828677
H  -3.32173 -0.261894 2.485875
H  -6.804558 -2.031651 0.695994
H  -6.407753 -0.329067 0.278628
H  -6.863003 -1.48569 -1.019237
H  -3.778139 -3.521962 -0.840013
H  -5.338321 -3.869515 -0.002701
H  -5.340493 -3.282038 -1.707062
H  -3.440972 2.662573 0.623795
H  -2.684919 1.918899 2.048788
H  -1.17178 3.299327 0.334801
H  -1.221985 1.837282 -0.654986
H  -0.539916 0.548148 1.577424
H  -0.095133 2.145366 2.20485
H  -0.69041 -0.343548 -0.292588
H  0.510689 4.00556 1.261912
H  4.019024 -1.571661 -1.438799
H  5.371456 3.338337 0.326014
H  2.137585 -3.070407 -2.152749
H  2.055354 5.915898 1.427123
H  4.512317 5.620844 0.933504
