program: Gaussian 09
title: 000213241
version: EM64L-G09RevD.01
frameworkgroup: C1[X(C13H14N2O3)]
method: RPBEPBE
basis: SDD
operation: Freq
keyword: #p
keyword: freq=noraman
keyword: PBEPBE/SDD
title: #p freq=noraman PBEPBE/SDD
converged: YES YES NO NO
title: Mulliken charges:
elementType: O O O N N C C C C C C C C C C C C C H H H H H H H H H H H H H H
charge: -0.220582 -0.222533 -0.207403 -0.200249 -0.332668 -0.360549 -0.385242 0.138878 0.167006 -0.481939 0.480370 0.228887 -0.351067 -0.410402 -0.770938 -0.213470 -0.203274 -0.248859 0.290697 0.255124 0.254098 0.247124 0.244520 0.339959 0.297398 0.232632 0.236621 0.235848 0.258826 0.233614 0.232086 0.235487
chargesum: 0.00000
title: Mulliken charges with hydrogens summed into heavy atoms:
elementType: O O O N N C C C C C C C C C C C C C
charge: -0.220582 -0.222533 -0.207403 -0.200249 0.007290 -0.069853 0.123980 0.138878 0.167006 0.009704 0.480370 0.228887 -0.053669 -0.177770 -0.039643 0.020144 0.028812 -0.013371
polarizability: 2.10607931e+02 3.64742582e+01 1.27262329e+02 1.79923456e+01 -9.50526527e+00 1.48204766e+02
1716.lowfreq: -45.6276 -11.1463 -0.0005 -0.0004 -0.0003 0.4472 8.4047 21.5758 38.4120
frequency: -45.5885 20.5224 38.3989 42.7764 55.9285 75.7267 97.3481 113.7149 131.4815 167.2980 201.0125 220.2522 285.5723 300.7315 351.0245 359.8499 390.7172 395.8170 405.2046 464.0265 466.1853 516.6375 556.3064 568.5001 585.5216 613.3639 638.0746 656.0249 692.1552 712.1028 742.5222 762.1434 783.8758 830.4537 836.8277 864.7149 879.7144 907.4281 937.5636 948.4780 970.8374 983.7133 995.0437 1013.7696 1032.0029 1063.9074 1082.0041 1098.5262 1128.4853 1166.4789 1169.9632 1176.9813 1192.7945 1198.6179 1209.9191 1229.5292 1260.3238 1283.2780 1299.2931 1308.4158 1334.1580 1363.3025 1369.5000 1377.4997 1405.5508 1430.1220 1443.9652 1449.6143 1453.8328 1455.6248 1488.2738 1589.1612 1610.1032 1631.6281 1637.4595 1678.8186 2963.7649 2982.2705 3009.5494 3011.6785 3029.7514 3065.0576 3092.1641 3123.3122 3133.1711 3142.7821 3154.0703 3170.5464 3195.6159 3548.7659
redmass: 1.3533 5.2999 4.0822 3.8835 5.4758 6.3866 1.6271 5.1912 5.2695 6.7774 2.7631 6.3860 7.4192 7.7422 2.9073 6.4609 6.0211 2.2748 2.9384 2.1916 2.0778 2.6019 6.3810 4.3911 5.8332 6.3873 5.1503 4.2160 2.0563 3.3808 1.7682 1.7162 5.0747 1.8705 1.7307 3.3221 2.9325 1.4225 2.1650 1.6239 1.3670 5.6190 1.3312 2.6364 2.1462 2.1022 2.0312 2.3369 3.0285 1.7454 1.5552 1.0536 2.5944 1.1437 1.8303 1.5237 4.8091 2.4910 1.1882 1.6704 1.3283 1.6031 1.2594 4.8338 2.6351 1.0872 1.0845 2.3929 1.0951 1.0496 2.4038 6.3612 5.9755 11.2916 7.4864 9.7353 1.0593 1.0379 1.0797 1.0982 1.0626 1.0964 1.1037 1.0998 1.0853 1.0888 1.0944 1.0998 1.0957 1.0804
irintensity: 1.6658 0.2876 0.1165 4.1819 1.0327 2.0268 0.3300 11.8129 0.3291 2.4170 3.1906 1.4019 21.0182 3.3439 4.2575 4.7765 19.8146 36.8717 0.2902 64.3560 26.0823 11.6181 13.8262 11.3645 4.4612 1.2241 4.1551 4.4982 33.5352 9.8498 5.0209 73.8713 19.9034 0.3210 1.8386 2.7796 1.5031 7.9037 3.7603 3.2744 0.6322 0.0410 0.7664 4.3686 9.4425 8.7934 7.0329 15.9121 2.9832 44.8635 8.4560 0.5889 21.9587 7.1176 18.2540 1.8801 155.9253 201.0167 4.1273 110.7807 3.2321 19.3408 62.7421 34.1247 38.1799 7.6958 33.4050 6.5648 34.0417 21.5516 134.8436 2.0372 73.5552 332.8208 109.0089 276.8869 8.8931 5.8294 5.3203 5.3146 10.2679 11.8813 7.3019 14.8158 4.3477 5.8023 26.9307 16.9305 3.5775 33.2844
temp: 298.150 k
press: 1.00000 atm
elementType: 8 8 8 7 7 6 6 6 6 6 6 6 6 6 6 6 6 6 1 1 1 1 1 1 1 1 1 1 1 1 1 1
symmnumber: 1
zpe: 650894.1 jmol-1
zpe.correction: 0.247912 hartree
zpe.thermalcorrener: 0.264406 hartree
zpe.thermalcorrenthalpy: 0.265350 hartree
zpe.thermalcorrgfe: 0.201425 hartree
zpe.sumelectzpe: -837.638690 hartree
zpe.sumelectthermal: -837.622196 hartree
zpe.sumelectthermalent: -837.621252 hartree
zpe.sumelectthermalfe: -837.685178 hartree
dipole: -4.9468 -1.2389 -2.8737
dipole: 5.8535
quadrupole: -112.4276 -108.6318 -104.7918
quadrupole: -2.8885 -1.2888 7.9798
quadrupole: -3.8105 -0.0147 3.8253 -2.8885 -1.2888 7.9798
hfenergy: -837.8866026 hartree
pointgroup: C01 [X(C13H14N2O3)]
dipole: -1.9818472 -0.2865189 -1.1374453 debye
polarizability: 213.1086583|31.5893329|128.8000193|20.8411733|-13.2624226|144.1663483 unknown
InChI: InChI=1S/C13H14N2O3/c1-9(16)7-8-11-12(17)14-15(13(11)18)10-5-3-2-4-6-10/h2-6,11,14H,7-8H2,1H3
charge 0 multiplicity 1
32 atoms
O  -0.043225 -0.579168 2.172172
O  1.559836 2.984858 -0.73624
O  4.825363 -1.250838 0.18072
N  -0.90103 0.663032 0.339297
N  -0.373041 1.661403 -0.544088
C  1.314135 1.188258 1.019111
C  2.614562 0.369506 0.808301
C  0.081234 0.312936 1.292811
C  0.914042 2.064046 -0.175302
C  2.548459 -0.582644 -0.399117
C  -2.159489 0.053031 0.059987
C  3.843915 -1.380136 -0.597459
C  -2.809198 -0.714792 1.064923
C  -2.771019 0.224182 -1.211096
C  3.880371 -2.332853 -1.786616
C  -4.062772 -1.29507 0.786739
C  -4.031483 -0.357866 -1.465178
C  -4.686586 -1.117399 -0.470706
H  1.474414 1.853993 1.889946
H  2.81475 -0.208422 1.727206
H  3.453071 1.076011 0.680212
H  1.716208 -1.309016 -0.28895
H  2.34281 -0.025102 -1.336539
H  -1.023577 2.23883 -1.080967
H  -2.325533 -0.8593 2.032652
H  -2.262508 0.766225 -2.015302
H  3.751929 -1.772596 -2.732482
H  3.049233 -3.060959 -1.728525
H  4.839226 -2.87278 -1.812243
H  -4.556954 -1.886975 1.564652
H  -4.494457 -0.222599 -2.448636
H  -5.66409 -1.566894 -0.672981
