program: Gaussian 09
title: 000015371
version: EM64L-G09RevD.01
frameworkgroup: C1[X(C9H7ClO2)]
method: RPBEPBE
basis: SDD
operation: Freq
keyword: #p
keyword: freq=noraman
keyword: PBEPBE/SDD
title: #p freq=noraman PBEPBE/SDD
converged: YES YES NO NO
title: Mulliken charges:
elementType: Cl O O C C C C C C C C C H H H H H H H
charge: -0.039914 -0.431300 -0.252967 0.504181 -0.357000 -0.373097 -0.255992 -0.212618 -0.217469 -0.107343 -0.309939 0.157598 0.237873 0.244357 0.264436 0.259404 0.260958 0.249576 0.379256
chargesum: 0.00000
title: Mulliken charges with hydrogens summed into heavy atoms:
elementType: Cl O O C C C C C C C C C
charge: -0.039914 -0.052044 -0.252967 0.504181 -0.119127 -0.128740 0.008444 0.046786 0.043488 -0.107343 -0.060363 0.157598
polarizability: 2.43573347e+02 -4.59888101e+00 1.06255720e+02 2.41092107e-03 -3.06075735e-03 4.31374031e+01
1716.lowfreq: -3.9817 -1.1386 0.0019 0.0019 0.0024 2.5302 42.6858 57.2429 80.5307
frequency: 42.6814 57.2424 80.5307 142.4405 185.1490 198.7310 245.7134 323.5518 343.0346 409.7990 418.2272 491.6577 504.7335 571.9633 588.6214 626.5756 670.6243 681.4619 725.8557 826.0931 826.5134 831.3554 890.6575 938.8948 956.5337 968.7254 998.3613 1015.1312 1049.4684 1076.1162 1110.9563 1188.2973 1217.2720 1235.9007 1292.2393 1315.9477 1336.8705 1380.2828 1405.1266 1480.4340 1572.7901 1596.4244 1630.4099 1652.0971 3103.2262 3138.5839 3148.0174 3164.2330 3172.6599 3175.8678 3526.6944
redmass: 5.6738 10.4887 7.6575 4.3163 3.3268 10.4852 9.2603 5.5963 3.7040 2.8302 8.8878 2.5193 4.3628 5.4650 1.2852 7.0888 6.5552 3.3271 3.7017 1.2660 5.3540 1.5578 1.8985 4.9314 1.3478 1.3770 3.9635 1.1975 2.2852 2.6575 1.3956 1.1255 1.4752 1.7869 1.4276 1.5250 2.2838 4.2450 3.3362 2.4623 7.1114 6.1221 8.2407 5.7313 1.0902 1.0900 1.0889 1.0919 1.0959 1.0968 1.0641
irintensity: 0.2137 1.0324 0.5990 1.5357 0.3688 0.6285 1.3386 1.8848 0.8336 0.0291 46.5281 8.2467 9.3134 21.8581 153.4655 0.1879 13.4273 34.9365 0.7159 0.7912 36.1807 83.0543 2.9649 3.8301 2.2309 0.0717 40.1939 46.9379 590.3577 19.1108 7.3363 5.5473 19.2493 4.6376 1.8676 13.8674 57.2672 48.0268 17.2363 89.0786 3.6700 159.7223 378.8918 116.7559 1.8455 5.9011 4.4604 6.6694 6.5603 1.3312 58.1169
temp: 298.150 k
press: 1.00000 atm
elementType: 17 8 8 6 6 6 6 6 6 6 6 6 1 1 1 1 1 1 1
symmnumber: 1
zpe: 356073.1 jmol-1
zpe.correction: 0.135621 hartree
zpe.thermalcorrener: 0.146498 hartree
zpe.thermalcorrenthalpy: 0.147442 hartree
zpe.thermalcorrgfe: 0.097384 hartree
zpe.sumelectzpe: -956.812392 hartree
zpe.sumelectthermal: -956.801515 hartree
zpe.sumelectthermalent: -956.800571 hartree
zpe.sumelectthermalfe: -956.850630 hartree
dipole: -0.4577 -0.8730 0.0011
dipole: 0.9858
quadrupole: -81.6404 -71.5550 -79.7201
quadrupole: -7.7978 0.0002 0.0080
quadrupole: -4.0019 6.0835 -2.0816 -7.7978 0.0002 0.0080
hfenergy: -956.9480135 hartree
pointgroup: C01 [X(C9H7Cl1O2)]
dipole: 0.1771833 0.3445929 -0.0164398 debye
dipolederiv: -1.0490562 -0.0810503 0.0152838 -0.1172123 -0.1282112 0.0043976 0.0168025 0.003964 -0.059328 -1.101511 0.5871304 -0.0168345 0.7385029 -0.8265234 0.007855 -0.0233092 0.0096555 -0.4382315 -1.0404661 -0.1978517 0.0163644 -0.4454349 -0.8859218 0.0281564 0.0264803 0.0252579 -0.3366842 -0.3999086 -0.0393948 0.0067856 -0.1398589 -0.0782992 0.0062298 0.0108907 0.0050506 0.0287832 0.1328984 -0.0521269 -0.0007554 0.1772815 0.0489011 -0.0096829 -0.0104128 -0.0069776 -0.1242953 0.1883361 0.0965817 -0.0082639 -0.1478506 0.0822922 -0.0084687 0.0018108 -0.0113207 -0.1512297 1.0638022 0.0022187 -0.0134673 -0.1670202 0.1296198 -0.0065959 -0.0061201 -0.0085818 -0.0771699 -0.5186474 0.0723675 0.0018063 0.1904747 0.0168786 -0.0072816 -0.0033557 -0.0058539 -0.0987879 -0.3942427 -0.1607742 0.0105118 -0.2976043 -0.0474436 0.0013618 0.0165688 -0.0003114 -0.0976635 1.4372883 0.1302257 -0.0235368 0.127097 0.1871035 -0.0124599 -0.0233036 -0.0125076 -0.064651 -1.4663381 0.0685298 0.0120734 0.2959071 0.0274364 -0.0122609 0.001982 -0.0096554 -0.1875448 2.5913999 -0.2768805 -0.0153724 0.0926634 1.3275759 -0.0465666 -0.0303261 -0.0422941 0.2445736 0.0165851 0.0962707 -0.0026619 0.0628347 -0.0043154 0.0058266 -0.0012037 0.00544 0.1464864 0.0422331 -0.0868751 0.0051079 -0.0564027 -0.0378253 0.0091158 0.0037861 0.0094399 0.1558378 0.0782266 -0.0089451 0.0011671 -0.0529901 -0.0276738 0.0080596 0.0033414 0.0075746 0.1514419 0.0570292 -0.0544565 0.0036494 -0.0593952 -0.0111558 0.008373 0.0038286 0.0083174 0.1654946 0.0272591 0.0722934 -0.0014645 0.0710366 0.0206599 0.0055645 -0.001385 0.0055716 0.1679368 0.0719831 -0.0549058 0.0034304 -0.0862235 -0.0362784 0.0097127 0.0045877 0.0093993 0.1747301 0.2631291 -0.1123569 0.0061767 -0.185805 0.2431804 0.0086636 0.0093375 0.0078317 0.4003013 unknown
polarizability: 243.6131794|-3.5432397|106.0761784|-2.2063487|-2.6550003|43.2771122 unknown
InChI: InChI=1S/C9H7ClO2/c10-8-4-1-7(2-5-8)3-6-9(11)12/h1-6,11H
charge 0 multiplicity 1
19 atoms
Cl 4.920555 0.334321 -0.065951
O  -4.396969 1.159011 0.009196
O  -3.997652 -1.134774 0.100658
C  0.311621 -0.242148 0.014076
C  0.885319 1.062106 -0.049255
C  1.190575 -1.362816 0.052195
C  -1.135254 -0.483432 0.040925
C  2.280508 1.241591 -0.073706
C  2.590682 -1.20101 0.028505
C  3.116071 0.10415 -0.034474
C  -2.132279 0.453899 0.013329
C  -3.545477 0.037114 0.04653
H  0.240343 1.94618 -0.080094
H  0.770145 -2.373988 0.101124
H  -1.456706 -1.534521 0.088024
H  2.716071 2.243641 -0.122277
H  3.257301 -2.067213 0.05821
H  -1.946865 1.530953 -0.03326
H  -5.340989 0.845036 0.032746
