program: Gaussian 09
title: 000213262
version: EM64L-G09RevD.01
frameworkgroup: C1[X(C17H13N3O5)]
method: RPBEPBE
basis: SDD
operation: Freq
keyword: #p
keyword: freq=noraman
keyword: PBEPBE/SDD
title: #p freq=noraman PBEPBE/SDD
converged: YES YES NO NO
title: Mulliken charges:
elementType: O O O O O N N N C C C C C C C C C C C C C C C C C H H H H H H H H H H H H H
charge: -0.432726 -0.372014 -0.215533 -0.190631 -0.194174 -0.467635 0.025198 0.030171 0.163668 -0.200522 0.063168 -0.157775 0.490257 -0.308154 0.056274 -0.453211 0.336536 -0.324396 -0.337704 -0.320115 -0.178125 0.384255 -0.368863 -0.363035 -0.370758 0.256611 0.302175 0.281013 0.237520 0.249588 0.271564 0.289070 0.231173 0.299902 0.295134 0.245397 0.370370 0.376325
chargesum: 0.00000
title: Mulliken charges with hydrogens summed into heavy atoms:
elementType: O O O O O N N N C C C C C C C C C C C C C C C C C
charge: -0.062356 0.004311 -0.215533 -0.190631 -0.194174 -0.165461 0.025198 0.030171 0.163668 0.056089 0.063168 -0.157775 0.490257 -0.027140 0.056274 -0.215691 0.336536 -0.074808 -0.066140 -0.031045 0.053048 0.384255 -0.068961 -0.067901 -0.125360
polarizability: 3.37761157e+02 -1.26764768e+01 2.82678356e+02 -3.55229847e+01 2.69079331e+00 1.14897353e+02
1716.lowfreq: -5.0624 -0.0004 0.0004 0.0005 3.4709 5.6260 17.7042 21.2459 29.7418
frequency: 17.6765 21.0181 29.7302 44.9824 57.0817 75.3612 81.3041 112.2594 132.2222 143.3975 165.3780 212.6927 235.2971 251.7836 255.8099 266.5541 269.9570 324.6358 340.9522 403.1529 405.0392 426.3740 434.7628 457.5286 462.4566 476.7406 491.7616 514.6141 521.0972 529.9815 559.5613 573.3670 581.0950 622.4502 638.3391 659.9413 668.0450 675.7977 686.3154 693.8476 730.8129 751.3899 764.0228 781.7176 788.1191 807.8662 846.0251 852.9667 857.8192 861.7235 886.3047 937.7789 939.8279 959.2592 973.1711 990.1634 992.9705 1001.2094 1010.0762 1014.6095 1032.6561 1061.0996 1086.1594 1090.3486 1114.2336 1144.0455 1181.2458 1183.4592 1200.9269 1212.1056 1217.8541 1229.2718 1252.1246 1254.3785 1270.8190 1298.1406 1304.7563 1348.2440 1366.4926 1375.2696 1381.0591 1400.6254 1403.9594 1411.6255 1423.4953 1433.3355 1460.9300 1477.4918 1505.3715 1541.3720 1564.3027 1592.9437 1598.3598 1607.0616 1620.6739 3064.4274 3123.9777 3132.6397 3134.9468 3162.3350 3164.2874 3166.2534 3167.1453 3187.8293 3191.0952 3315.8727 3419.8994 3433.8572
redmass: 8.3230 6.5387 6.0733 7.6244 8.8801 5.6215 8.7562 7.8666 5.7504 7.2446 5.5344 8.0459 5.6299 5.7805 6.3283 5.6739 8.7738 4.9205 4.0856 5.1010 2.8586 4.1282 4.5220 1.9891 4.6594 6.7381 7.2293 4.6330 3.2325 1.6799 4.4344 3.7818 3.7701 6.9822 5.3526 4.1115 4.6309 5.9722 3.1581 6.7324 2.0641 3.4511 2.1004 1.4398 5.5214 3.1306 2.8568 1.7183 1.6624 5.1376 1.7214 6.2243 1.4325 2.2671 1.6289 1.3872 1.4321 3.7674 2.6624 1.4821 2.4342 3.4295 4.0684 3.1947 1.3207 1.2427 1.5125 1.4300 1.3068 4.3105 2.0749 2.0561 2.6011 2.0281 2.4994 1.2688 1.4164 4.6470 3.4984 2.9393 1.6413 1.9562 9.9036 2.6485 1.5810 2.6437 3.2503 2.3605 4.2119 7.7063 8.6057 5.9736 7.7543 6.5031 6.8191 1.0854 1.0886 1.0909 1.0885 1.0971 1.0900 1.0992 1.0898 1.0955 1.0966 1.0624 1.0642 1.0739
irintensity: 0.2319 0.7449 0.0250 3.2060 0.8933 0.7242 4.7627 2.4746 0.2512 4.9996 3.5894 7.7215 7.4307 0.8896 2.5044 9.8355 2.7642 21.7087 9.3954 4.6704 0.5397 0.4744 3.6271 70.5536 0.2634 8.2998 5.9137 0.9763 6.9187 78.6574 0.2065 3.5136 25.7801 0.2191 15.4943 25.1738 48.9096 30.1923 10.8836 20.7828 34.6498 32.3668 50.1662 5.5838 49.0186 34.8875 55.3027 25.5561 5.1361 10.0207 31.5637 231.1522 1.4170 8.9091 9.3053 1.1071 12.5574 23.9321 58.6834 8.1933 4.1774 60.5839 52.7187 18.5549 19.3801 1.1436 10.6018 24.8315 17.9162 281.7832 48.8275 72.4335 176.1464 14.0487 22.8203 2.0048 14.3053 25.8960 87.2647 131.8086 30.6754 3.6984 1.7565 70.4432 25.5680 44.9739 45.4157 4.3944 19.9331 22.0659 128.8525 3.5631 20.2497 2.9354 3.8471 17.9070 14.1367 6.7355 13.5977 4.0493 2.2244 35.8081 2.6139 0.7483 3.1510 141.8574 43.8362 11.5645
temp: 298.150 k
press: 1.00000 atm
elementType: 8 8 8 8 8 7 7 7 6 6 6 6 6 6 6 6 6 6 6 6 6 6 6 6 6 1 1 1 1 1 1 1 1 1 1 1 1 1
symmnumber: 1
zpe: 721222.6 jmol-1
zpe.correction: 0.274699 hartree
zpe.thermalcorrener: 0.295619 hartree
zpe.thermalcorrenthalpy: 0.296563 hartree
zpe.thermalcorrgfe: 0.222062 hartree
zpe.sumelectzpe: -1194.133622 hartree
zpe.sumelectthermal: -1194.112703 hartree
zpe.sumelectthermalent: -1194.111759 hartree
zpe.sumelectthermalfe: -1194.186260 hartree
dipole: 3.1771 3.6319 -0.7512
dipole: 4.8835
quadrupole: -139.0650 -159.0263 -144.2322
quadrupole: -17.6150 -7.9118 5.9821
quadrupole: 8.3762 -11.5851 3.2089 -17.6150 -7.9118 5.9821
hfenergy: -1194.4083217 hartree
pointgroup: C01 [X(C17H13N3O5)]
dipole: 1.131128 1.4552915 -0.5424103 debye
polarizability: 334.3643975|-14.6081632|279.0192104|-46.900203|-18.7184839|121.9532578 unknown
InChI: InChI=1S/C17H13N3O5/c21-15(11-3-6-12(7-4-11)20(24)25)17(23)19-13-8-5-10-2-1-9-18-14(10)16(13)22/h1-9,17,19,22-23H
charge 0 multiplicity 1
38 atoms
O  0.000791 3.60767 -1.136247
O  1.098062 -0.772694 1.239676
O  -2.309111 3.378294 0.181486
O  -4.41904 -3.686025 -0.092051
O  -6.13565 -2.460648 0.779735
N  0.50274 1.741429 0.391544
N  3.539923 -2.037437 0.66335
N  -4.944966 -2.575171 0.296992
C  1.801306 1.196951 0.025197
C  -0.347883 2.266767 -0.690875
C  2.061109 -0.109351 0.494408
C  3.310954 -0.756495 0.188223
C  4.273466 -0.026742 -0.617941
C  2.756073 1.89498 -0.773753
C  -1.811166 2.265201 -0.167391
C  3.973445 1.291819 -1.092727
C  -2.578393 0.989006 -0.050254
C  5.511957 -0.689369 -0.908201
C  -2.038401 -0.267799 -0.441687
C  -3.906023 1.056288 0.457736
C  5.738524 -1.978163 -0.423417
C  -4.122668 -1.337061 0.178758
C  -2.810353 -1.439287 -0.330101
C  -4.686934 -0.105266 0.577814
C  4.718667 -2.612929 0.357327
H  -0.225946 1.605381 -1.564403
H  0.520502 2.367606 1.209037
H  2.504041 2.900899 -1.125414
H  4.713109 1.822011 -1.702936
H  6.267143 -0.172145 -1.511293
H  -1.01979 -0.343931 -0.831685
H  -4.302846 2.033301 0.750106
H  6.673621 -2.508595 -0.628507
H  -2.416864 -2.41689 -0.618977
H  -5.708499 -0.080582 0.965253
H  4.873654 -3.626845 0.745466
H  -0.630476 4.241787 -0.689131
H  0.322218 -0.134568 1.293284
