program: Gaussian 09
title: 000213230
version: EM64L-G09RevD.01
frameworkgroup: C1[X(C12H10N2O)]
method: RPBEPBE
basis: SDD
operation: Freq
keyword: #p
keyword: freq=noraman
keyword: PBEPBE/SDD
title: #p freq=noraman PBEPBE/SDD
converged: YES YES NO YES
title: Mulliken charges:
elementType: O N N C C C C C C C C C C C C H H H H H H H H H H
charge: -0.273175 -0.006181 -0.409410 -0.593690 -0.580244 0.364108 0.443159 0.217292 -0.150338 -0.423946 -0.467856 -0.369762 -0.232622 -0.243229 0.190065 0.236190 0.233437 0.241597 0.235660 0.237351 0.268678 0.271979 0.230104 0.232412 0.348420
chargesum: 0.00000
title: Mulliken charges with hydrogens summed into heavy atoms:
elementType: O N N C C C C C C C C C C C C
charge: -0.273175 -0.006181 -0.060990 -0.124063 -0.102987 0.364108 0.443159 0.217292 -0.150338 -0.186594 -0.199178 -0.097783 -0.002518 -0.010817 0.190065
polarizability: 2.38884114e+02 -1.13407461e+00 1.45603775e+02 -1.70674828e+00 -1.50262251e+00 6.67587221e+01
1716.lowfreq: -10.5159 -7.0925 -0.0005 -0.0003 0.0004 4.4158 64.0635 96.9104 143.5705
frequency: 64.0607 96.9079 143.5689 190.7942 207.0733 254.6644 331.0571 341.1558 391.7472 411.8057 440.2479 466.9259 480.8877 512.0048 540.6623 578.6196 590.4640 645.3624 690.8727 701.8326 739.6790 746.4864 770.4371 785.7913 788.9607 881.6680 883.1372 895.2006 904.4305 963.0223 987.8292 996.5270 1013.7125 1035.6495 1043.5287 1092.7647 1131.5936 1159.6530 1174.5079 1187.6360 1207.2263 1218.3843 1224.9190 1275.8309 1294.8791 1310.5741 1354.0595 1381.3413 1387.0466 1397.1932 1446.0097 1452.4418 1461.9504 1482.1465 1495.6642 1574.2151 1586.4233 1614.7310 1661.5376 2969.1193 2977.0689 3049.5379 3055.6794 3120.8720 3136.9870 3154.1219 3163.5429 3169.3212 3516.9769
redmass: 7.3228 3.8168 4.6164 4.3968 3.7876 2.8093 7.7677 3.8579 4.9905 4.3520 3.7654 3.7510 4.6315 3.8294 5.3240 7.5897 2.8030 3.2297 5.3686 5.6692 4.0850 2.1422 1.3802 2.9220 2.2144 2.2749 1.3694 1.4796 3.3968 1.3922 2.5688 1.3392 5.2178 2.1939 2.1608 2.8867 2.2932 1.2285 1.0614 1.5710 1.6129 3.1732 2.5591 1.5256 2.3186 1.5041 1.6220 4.6244 3.2364 2.0519 2.2668 1.1708 1.1556 2.6364 3.5290 7.0801 6.8990 6.5234 6.4742 1.0681 1.0624 1.0948 1.0975 1.0872 1.0892 1.0943 1.0932 1.0993 1.0788
irintensity: 0.8630 0.1400 3.1941 0.7900 7.5441 2.0461 1.5858 1.9559 1.8411 4.1604 1.8813 5.7468 7.5550 0.6340 3.3552 17.4861 2.5312 1.5614 0.5231 7.0149 4.8010 19.8644 155.7970 1.6722 9.5223 2.0798 6.3684 13.4014 41.7002 3.4152 10.1209 0.2026 7.6026 6.0489 3.6562 29.6732 29.4957 1.2868 0.6918 12.5167 8.8586 6.1772 50.2322 12.5970 7.7244 0.0528 1.5141 0.9276 11.5263 4.3307 11.3730 21.9023 11.3593 10.6054 8.8139 76.1398 22.7515 3.0262 451.0242 17.3646 23.4173 29.8998 25.8112 6.6569 12.3203 21.1601 2.2927 21.4500 54.9861
temp: 298.150 k
press: 1.00000 atm
elementType: 8 7 7 6 6 6 6 6 6 6 6 6 6 6 6 1 1 1 1 1 1 1 1 1 1
symmnumber: 1
zpe: 510821.8 jmol-1
zpe.correction: 0.194562 hartree
zpe.thermalcorrener: 0.205587 hartree
zpe.thermalcorrenthalpy: 0.206531 hartree
zpe.thermalcorrgfe: 0.157630 hartree
zpe.sumelectzpe: -646.969724 hartree
zpe.sumelectthermal: -646.958699 hartree
zpe.sumelectthermalent: -646.957755 hartree
zpe.sumelectthermalfe: -647.006655 hartree
dipole: -4.3777 1.6874 0.2830
dipole: 4.7002
quadrupole: -103.2433 -73.9526 -89.2212
quadrupole: -0.5879 0.3488 -0.3124
quadrupole: -14.4376 14.8531 -0.4155 -0.5879 0.3488 -0.3124
hfenergy: -647.1642853 hartree
pointgroup: C01 [X(C12H10N2O1)]
dipole: 1.713353 -0.6879567 0.1032342 debye
dipolederiv: -1.7085595 0.0630023 -0.0213068 0.1046957 -0.4085936 0.00885 -0.0413357 0.0049446 -0.3855656 0.300473 -0.5232535 0.0681192 0.1149755 -0.1625536 0.0055377 -0.0759144 0.02019 -0.1237693 -1.0943472 0.353392 -0.0504294 -0.7596625 -0.1062702 -0.021199 0.1107318 -0.0314092 -0.2531709 0.0838976 -0.0898072 0.0231171 -0.0647082 0.0500042 -0.0105542 -0.0273662 -0.0570709 0.1265958 0.0008204 0.1185826 0.0080542 0.1063674 -0.0036207 0.0284239 -0.0794808 0.0574661 0.0865449 -0.024221 0.1618811 0.0522579 0.0739332 0.147075 0.0464259 0.0869334 0.1031765 -0.0355659 0.2440804 -0.0871105 0.0611172 -0.1033855 0.2617675 -0.0646259 0.1149031 -0.0800308 0.0532792 0.0886767 -0.0004588 -0.005419 -0.1351681 -0.0959618 -0.009535 0.0451911 -0.0277908 -0.0208313 0.5089586 0.0805462 -0.011513 0.0949282 -0.1968491 0.0226027 -0.0088431 0.0348717 0.0102122 -0.0408684 -0.1805299 -0.0285427 -0.1676241 -0.0076151 0.0295237 -0.0569877 0.0253031 -0.1556497 -0.4707335 0.1642935 -0.0352865 0.4195314 -0.0593921 -0.009196 -0.083663 -0.0093981 -0.1405251 -0.0662401 -0.0835612 -0.0136015 0.0048872 0.0134931 0.0327988 -0.0222397 0.0091754 -0.1215448 0.0326027 0.0024952 0.0070942 -0.0479858 0.0086675 0.0190294 -0.0075447 0.0179628 -0.1435511 -0.0814635 0.1130327 0.0129725 0.1552658 0.0587802 0.0333043 0.0257484 0.0318027 -0.1597317 2.0454646 -0.0677279 0.0412681 0.2719018 0.3929429 -0.0271554 0.0020443 -0.0198108 0.2490504 0.04911 -0.0824788 -0.0588621 -0.0491325 0.0330772 -0.0102308 -0.0127161 -0.0549748 -0.1149545 -0.0569638 0.1366938 -0.0115418 0.0736051 -0.076797 0.0219699 -0.0095648 0.0580785 0.0822378 0.0460625 0.0577465 -0.0529137 0.0606701 0.0701023 -0.009353 -0.0105576 0.0214327 -0.0968915 -0.047702 -0.1475674 -0.0064072 -0.0648884 -0.0822526 -0.0185094 -0.0035095 -0.0496564 0.0869937 0.0331328 0.0591091 0.0108531 0.1170576 -0.0753606 -0.0321473 0.0175037 -0.0268575 0.1437273 0.0599734 -0.0383655 0.0071023 -0.050174 -0.0125476 0.0208342 0.0081131 0.017907 0.1432305 0.0891705 0.0838935 0.0185839 0.0498651 0.0047728 -0.0271719 0.022601 -0.0184525 0.1467005 -0.1427471 -0.0114361 0.0000229 -0.0049334 0.0895626 -0.0089844 0.0003332 -0.0069568 0.1573902 0.0133723 -0.0857293 -0.0116078 -0.1126392 -0.0675228 -0.0318131 -0.0125134 -0.0346027 0.1539994 0.1380507 0.0033575 -0.0031311 -0.0873826 0.2250914 0.0111749 0.0181334 0.0147004 0.3117893 unknown
polarizability: 238.8448294|-2.4225301|145.6429388|1.1198019|1.7340567|66.7588437 unknown
InChI: InChI=1S/C12H10N2O/c15-11-7-9-6-5-8-3-1-2-4-10(8)12(9)14-13-11/h1-4,7,13H,5-6H2
charge 0 multiplicity 1
25 atoms
O  -4.557268 0.38654 -0.059932
N  -1.097551 1.496201 -0.143566
N  -2.464133 1.42643 -0.143998
C  1.01131 -2.139954 -0.406372
C  -0.296574 -2.180616 0.418626
C  1.772037 -0.841457 -0.173646
C  -1.136444 -0.939027 0.180476
C  1.045017 0.372566 0.014124
C  -0.436018 0.330917 0.012561
C  3.18544 -0.803354 -0.175265
C  -2.518865 -0.954828 0.153547
C  1.746614 1.595886 0.179267
C  3.87933 0.415416 -0.007874
C  3.154347 1.619427 0.166733
C  -3.294969 0.271195 -0.019421
H  0.762038 -2.233948 -1.483495
H  1.646223 -3.00728 -0.150723
H  -0.036344 -2.224882 1.496385
H  -0.882015 -3.088592 0.188389
H  3.745352 -1.73616 -0.31372
H  -3.087598 -1.881767 0.273835
H  1.170361 2.515891 0.315744
H  4.974839 0.427238 -0.009425
H  3.687105 2.567369 0.298197
H  -2.940134 2.325691 -0.265846
