program: Gaussian 09
title: 000213231
version: EM64L-G09RevD.01
frameworkgroup: C1[X(C9H12N2O4)]
method: RPBEPBE
basis: SDD
operation: Freq
keyword: #p
keyword: freq=noraman
keyword: PBEPBE/SDD
title: #p freq=noraman PBEPBE/SDD
converged: YES YES NO NO
title: Mulliken charges:
elementType: O O O O N N C C C C C C C C C H H H H H H H H H H H H
charge: -0.207693 -0.208737 -0.428407 -0.215365 -0.375576 -0.369809 0.084838 -0.445997 -0.523933 0.156857 0.141187 -0.345587 -0.022659 0.155593 -0.585062 0.269233 0.218580 0.229019 0.256541 0.237415 0.199511 0.367950 0.369763 0.260855 0.335524 0.225856 0.220106
chargesum: 0.00000
title: Mulliken charges with hydrogens summed into heavy atoms:
elementType: O O O O N N C C C C C C C C C
charge: -0.207693 -0.208737 -0.092883 -0.215365 -0.007627 -0.000046 0.084838 0.041815 -0.038374 0.156857 0.141187 0.091339 0.238196 0.155593 -0.139100
polarizability: 1.59060816e+02 -8.39003737e+00 1.00444874e+02 5.66743810e+00 7.62878480e+00 1.10376586e+02
1716.lowfreq: -15.4631 -0.0007 -0.0007 -0.0006 4.3352 6.6144 26.3373 62.5730 68.8303
frequency: 25.8805 62.5259 68.7909 78.1845 98.3186 125.8831 137.6569 150.3472 169.4845 207.2135 262.5858 297.5082 301.9673 336.5139 358.6836 369.6226 383.5678 451.3688 483.3322 490.6810 587.0899 616.4617 634.4743 656.2878 687.2995 729.5105 756.5482 763.1614 779.7634 789.8437 878.7032 921.6785 933.1336 955.5509 959.0447 988.5577 995.9497 1006.5222 1048.5170 1079.7897 1096.7044 1141.8445 1173.5508 1206.2469 1252.7029 1282.7603 1293.7933 1302.6556 1309.6484 1322.3908 1350.6720 1362.6077 1376.1482 1377.0899 1389.1727 1429.3292 1444.3578 1461.4298 1477.2309 1614.1856 1649.3299 1657.0504 1678.4758 2954.2018 2968.4215 3011.4070 3050.8790 3072.7212 3089.5134 3097.2659 3120.1106 3199.9805 3516.9078 3518.8897 3557.5067
redmass: 9.3448 3.6915 4.7132 2.7243 2.2783 3.6761 6.3483 8.6283 4.0413 4.0099 2.7704 2.5511 3.5761 1.4050 10.8083 4.1120 4.1056 2.8963 8.7510 5.4745 3.9001 2.5686 3.2402 2.5282 2.7849 3.6780 1.8943 3.3481 1.4156 1.7290 1.7454 3.4451 2.0607 1.7745 1.6485 3.5847 3.8264 1.2158 2.5117 2.3485 2.1568 2.2622 2.2665 2.0329 1.5494 1.4081 1.2786 1.3970 1.9199 1.4233 1.4112 6.2143 1.7452 1.7026 1.2463 1.1766 1.0845 1.1050 1.0821 6.9001 7.7830 4.8171 5.5334 1.0685 1.0627 1.0633 1.0984 1.0929 1.0609 1.1014 1.0940 1.1143 1.0759 1.0781 1.0663
irintensity: 0.7369 0.8604 2.1374 0.0377 2.1802 1.5418 0.5328 10.0222 2.7513 0.1817 7.5790 16.5217 17.6553 134.9728 28.8861 3.2069 3.2669 2.0005 16.5385 30.2794 3.0112 4.5524 3.9569 2.6280 32.2926 31.7933 2.3942 2.1503 23.6967 187.0177 1.7709 20.2071 18.9753 40.1956 86.6171 11.2962 79.4148 2.6051 8.8139 20.9190 10.4400 26.9573 15.0881 42.8986 26.2399 29.9935 15.0914 81.6769 186.3906 69.4335 37.8595 191.6917 4.3882 5.2931 23.5060 5.4680 21.4521 17.0291 3.3353 311.3427 80.4748 5.4702 622.4547 55.4453 18.7276 10.9158 6.8218 9.4623 8.0359 9.3803 3.5895 17.7683 88.1921 49.4629 9.6559
temp: 298.150 k
press: 1.00000 atm
elementType: 8 8 8 8 7 7 6 6 6 6 6 6 6 6 6 1 1 1 1 1 1 1 1 1 1 1 1
symmnumber: 1
zpe: 546903.9 jmol-1
zpe.correction: 0.208305 hartree
zpe.thermalcorrener: 0.223529 hartree
zpe.thermalcorrenthalpy: 0.224474 hartree
zpe.thermalcorrgfe: 0.164995 hartree
zpe.sumelectzpe: -759.434239 hartree
zpe.sumelectthermal: -759.419015 hartree
zpe.sumelectthermalent: -759.418070 hartree
zpe.sumelectthermalfe: -759.477549 hartree
dipole: 0.0341 -1.7821 1.9133
dipole: 2.6149
quadrupole: -97.2043 -90.8040 -94.6096
quadrupole: -5.6152 6.2925 2.8626
quadrupole: -2.9983 3.4019 -0.4036 -5.6152 6.2925 2.8626
hfenergy: -759.642544 hartree
pointgroup: C01 [X(C9H12N2O4)]
dipole: 0.0365582 0.6598571 0.7884548 debye
polarizability: 157.927852|-10.3785897|101.9414608|-8.0114684|-7.5502003|110.0129627 unknown
InChI: InChI=1S/C9H12N2O4/c1-2-3-9(4-5-12)6(13)10-8(15)11-7(9)14/h2,10-12H,1,3-5H2
charge 0 multiplicity 1
27 atoms
O  -0.327985 0.711004 -2.182572
O  0.235016 -1.218518 2.217839
O  -2.600033 -2.911344 -0.721824
O  3.891171 0.07284 -0.345501
N  1.747368 0.46074 -1.19786
N  2.025284 -0.519315 0.933997
C  -0.302188 0.078196 0.197745
C  -1.595085 -0.758035 0.008209
C  -0.652575 1.470197 0.905292
C  0.337937 0.41442 -1.157934
C  0.645189 -0.628367 1.185195
C  -1.354753 -2.138666 -0.636305
C  -1.711394 2.282419 0.192096
C  2.645019 0.017122 -0.210295
C  -2.846707 2.723522 0.78877
H  -2.299175 -0.185326 -0.617647
H  -2.05024 -0.892096 1.008302
H  0.28436 2.059364 0.988619
H  -0.985224 1.228237 1.931286
H  -1.032072 -2.030703 -1.685228
H  -0.58053 -2.706483 -0.075999
H  2.175224 0.785608 -2.071608
H  2.659678 -0.905893 1.641034
H  -1.518796 2.532352 -0.860014
H  -2.925281 -3.097943 0.195426
H  -3.574032 3.337172 0.246074
H  -3.080978 2.488297 1.834802
