program: Gaussian 09
title: 000213365
version: EM64L-G09RevD.01
frameworkgroup: C1[X(C22H23ClN2O3S)]
method: RPBEPBE
basis: SDD
operation: Freq
keyword: #p
keyword: freq=noraman
keyword: PBEPBE/SDD
title: #p freq=noraman PBEPBE/SDD
converged: YES YES NO NO
title: Mulliken charges:
elementType: Cl S O O O N N C C C C C C C C C C C C C C C C C C C C C C H H H H H H H H H H H H H H H H H H H H H H H
charge: -0.042796 0.179081 -0.287884 -0.229593 -0.259686 -0.086068 -0.254553 -0.200780 -0.368645 -0.363970 -0.389310 -0.398399 -0.399057 -0.748223 0.219972 -0.064658 0.427141 -0.325500 -0.296989 -0.300645 0.233629 0.249255 -0.216406 -0.214773 -0.109307 -0.371045 -0.379652 -0.227549 -0.225133 0.222906 0.228729 0.226688 0.221280 0.216447 0.213636 0.208627 0.220742 0.223384 0.214896 0.288000 0.287507 0.243588 0.209953 0.251341 0.249297 0.250803 0.259588 0.260063 0.248076 0.249071 0.228289 0.228635
chargesum: 0.00000
title: Mulliken charges with hydrogens summed into heavy atoms:
elementType: Cl S O O O N N C C C C C C C C C C C C C C C C C C C C C C
charge: -0.042796 0.179081 -0.287884 -0.229593 -0.259686 -0.086068 -0.254553 -0.200780 0.082990 0.083998 0.040773 0.030970 0.039223 -0.172717 0.219972 0.178930 0.427141 0.135794 -0.047692 -0.049843 0.233629 0.249255 0.043183 0.045290 -0.109307 -0.122970 -0.130581 0.000740 0.003502
polarizability: 3.36176142e+02 -2.30595928e+00 3.18951565e+02 1.61946601e+01 -7.43101413e-01 1.93484799e+02
1716.lowfreq: -7.1527 -6.2540 -2.8799 -0.0025 -0.0015 -0.0009 3.1846 9.9689 13.1016
frequency: -4.0355 9.8742 12.6774 16.5973 29.8296 40.4527 72.9034 75.2213 83.1219 99.4918 129.1555 145.3139 159.6109 173.8447 191.6467 208.2495 221.9477 246.2562 284.2880 292.2015 297.5991 323.9397 336.3228 346.8699 365.5143 379.2236 388.8075 413.8277 417.1480 424.2333 448.5155 450.9751 453.8971 484.5350 495.9085 496.4882 508.2347 539.0936 545.6205 555.2912 569.3157 575.9089 594.5064 631.7345 649.4345 685.8253 711.9123 714.7511 717.0094 737.1266 754.3400 764.7349 787.1464 810.3294 821.5462 825.0757 826.6292 846.2062 849.5834 891.1909 899.5160 906.0502 928.9154 932.2877 945.9290 949.6492 964.0140 965.7419 979.4073 995.5917 1001.5378 1012.0989 1024.8128 1038.0949 1048.0677 1070.5197 1072.2444 1082.9477 1101.3496 1103.6847 1113.7265 1125.3933 1129.3856 1130.8968 1144.9139 1160.8696 1163.2539 1172.4195 1175.3062 1182.2319 1209.3167 1217.1310 1232.6258 1235.8884 1238.6431 1252.2064 1267.4304 1276.7056 1285.9028 1292.8514 1303.2613 1312.7428 1320.2373 1320.6287 1339.3813 1349.7832 1357.1591 1362.3952 1370.4376 1389.5803 1390.0143 1392.1138 1433.2229 1439.9048 1443.1316 1448.4155 1459.9164 1465.8126 1472.8889 1474.1024 1474.3519 1485.0221 1584.6287 1590.2388 1595.0953 1612.4925 1617.5159 2859.1421 2864.4751 2907.8346 2979.3743 2991.2438 2993.6423 2995.6392 3033.7067 3039.8227 3042.4865 3043.2546 3067.6226 3071.3691 3111.6063 3117.8136 3136.7505 3150.1629 3153.7392 3155.3883 3162.5737 3174.7511 3174.8229 3178.5774
redmass: 6.5084 6.5486 6.4252 4.0799 5.6402 8.2584 4.9963 6.0036 3.4419 5.7502 5.8671 3.7016 5.5122 3.7128 8.4415 4.0131 5.5786 3.9690 3.8459 4.7854 4.0264 3.0475 2.6149 6.7474 3.0123 3.2679 2.3084 2.9247 10.9215 3.0900 4.2128 3.1961 10.4106 5.6361 3.7638 3.6149 5.4132 5.1839 4.3862 4.1650 3.4625 4.0013 3.6202 6.9677 3.8013 4.7818 4.3493 4.5963 5.5436 5.0992 1.2390 3.9155 3.0686 1.5727 4.0082 1.2627 1.6828 1.8366 1.7477 3.2353 2.5343 1.5628 4.1312 1.3667 2.1505 1.4081 1.3642 1.2922 6.4404 2.4936 3.8675 1.5903 2.0343 2.5289 2.4859 2.7965 2.1538 2.5863 1.3337 2.6637 3.6522 1.1921 2.7893 2.3027 2.7041 1.0913 2.1589 1.7530 1.1283 1.2026 1.4909 3.9965 2.1396 1.3831 1.6286 1.4171 1.4508 1.4269 1.2562 1.3879 1.2735 1.3574 1.4488 2.8249 1.3719 1.7968 1.4741 6.3267 1.6062 2.7148 3.6690 1.8747 1.0896 1.0850 2.3099 1.0942 1.2026 1.0794 1.1140 2.4102 2.4680 1.0950 7.9699 7.4957 6.8470 7.0882 11.1781 1.0713 1.0698 1.0688 1.0765 1.0603 1.0743 1.0613 1.0900 1.0897 1.0867 1.0589 1.1013 1.1017 1.1070 1.0980 1.0851 1.0898 1.0894 1.0892 1.0947 1.1006 1.0967 1.0977
irintensity: 0.0049 0.0799 0.0806 0.0232 0.0712 0.1855 0.8818 0.8313 9.8701 1.2855 1.1780 2.7119 0.8272 0.9541 1.8884 1.8271 1.5016 1.6893 0.8647 0.7271 0.2476 1.8783 3.3095 1.7389 1.5278 1.6275 6.4196 0.1249 28.4698 10.7700 3.3901 4.4290 4.3735 2.5322 4.0097 4.1614 1.1194 22.0891 1.5065 2.6039 15.8067 4.7332 1.1414 1.8789 5.7548 6.0134 0.6412 9.0425 18.1205 0.3551 107.0829 22.6700 11.6197 2.6578 13.8217 2.8909 39.8882 7.5102 7.1196 4.0764 7.4794 4.1520 8.0307 5.2962 6.1435 0.2278 0.0003 0.0122 78.6717 29.4352 47.2097 1.5070 14.4322 11.8585 54.0498 55.3652 33.5643 23.1691 11.5329 18.3728 60.1931 0.6078 4.8579 3.9048 9.1325 8.1195 6.9661 2.7009 0.4620 8.1321 2.9190 94.5905 147.6564 76.5510 106.8571 12.7284 4.0204 20.1147 1.0335 28.6870 10.2228 3.9242 6.3463 141.9988 6.5968 92.4828 8.7089 0.6979 14.1744 10.8886 8.8184 7.7215 3.3566 10.6897 4.7327 8.2716 21.4548 1.8911 26.8304 133.2861 166.8776 23.4400 0.0502 31.0289 41.2659 3.8274 280.3933 37.6493 88.0125 69.2185 33.0694 7.6740 37.5184 30.5729 3.8878 65.2934 43.6384 7.2728 16.0951 27.9015 1.8467 14.1262 1.2714 13.2506 2.7885 5.8897 14.6707 16.4991 3.7125 0.2708
temp: 298.150 k
press: 1.00000 atm
elementType: 17 16 8 8 8 7 7 6 6 6 6 6 6 6 6 6 6 6 6 6 6 6 6 6 6 6 6 6 6 1 1 1 1 1 1 1 1 1 1 1 1 1 1 1 1 1 1 1 1 1 1 1
symmnumber: 1
zpe: 1071667.8 jmol-1
zpe.correction: 0.408177 hartree
zpe.thermalcorrener: 0.433185 hartree
zpe.thermalcorrenthalpy: 0.434129 hartree
zpe.thermalcorrgfe: 0.349254 hartree
zpe.sumelectzpe: -2043.303966 hartree
zpe.sumelectthermal: -2043.278958 hartree
zpe.sumelectthermalent: -2043.278013 hartree
zpe.sumelectthermalfe: -2043.362889 hartree
dipole: -1.4401 -1.5811 0.9172
dipole: 2.3271
quadrupole: -216.6261 -189.8272 -173.6914
quadrupole: -1.2608 6.2052 -1.6643
quadrupole: -23.2445 3.5544 19.6901 -1.2608 6.2052 -1.6643
hfenergy: -2043.7121425 hartree
pointgroup: C01 [X(C22H23Cl1N2O3S1)]
dipole: 0.5534973 -0.6021199 -0.4114532 debye
polarizability: 337.3381736|2.0789405|318.7211184|9.5897927|5.8151907|192.5532137 unknown
InChI: InChI=1S/C22H23ClN2O3S/c23-16-5-7-17(8-6-16)25-21(26)15-29-22(25)9-11-24(12-10-22)13-18-14-27-19-3-1-2-4-20(19)28-18/h1-8,18H,9-15H2
charge 0 multiplicity 1
52 atoms
Cl -4.669428 4.902835 0.298885
S  -2.370795 -3.522026 0.139695
O  4.406778 -0.959802 -0.47515
O  -5.795083 -1.561872 0.785736
O  3.810595 1.903416 -0.343581
N  0.676085 -1.205421 -0.619383
N  -3.547164 -1.066655 0.300974
C  -2.179476 -1.588167 0.0239
C  -1.146834 -1.123499 1.076057
C  -1.687387 -1.218168 -1.394231
C  0.265737 -1.640274 0.740607
C  -0.257119 -1.735333 -1.645783
C  2.098459 -1.502382 -0.914608
C  -4.206208 -3.407565 0.525619
C  -4.61362 -1.934787 0.554303
C  3.025653 -0.438446 -0.307278
C  -3.79458 0.362715 0.295965
C  2.910135 0.927062 -0.993391
C  -4.224205 1.001476 -0.890743
C  -3.658576 1.108929 1.48968
C  5.410261 0.0079 -0.223853
C  5.117161 1.398329 -0.143892
C  -4.492428 2.387202 -0.897055
C  -3.922133 2.495609 1.497179
C  -4.329923 3.113462 0.298882
C  6.733383 -0.444312 -0.044961
C  6.144753 2.318963 0.145065
C  7.762901 0.481277 0.231312
C  7.466464 1.862455 0.337121
H  -1.450556 -1.477145 2.077311
H  -1.121754 -0.016686 1.081428
H  -1.680285 -0.114839 -1.487673
H  -2.378566 -1.63419 -2.148781
H  0.979867 -1.240283 1.482128
H  0.286471 -2.756374 0.832232
H  -0.267851 -2.855006 -1.659702
H  0.082246 -1.395301 -2.641042
H  2.421315 -2.501919 -0.538922
H  2.243876 -1.509509 -2.011095
H  -4.417541 -3.861538 1.506638
H  -4.790765 -3.930397 -0.247706
H  2.837281 -0.31159 0.778218
H  3.179313 0.838001 -2.065398
H  1.892706 1.331385 -0.888017
H  -4.365591 0.412758 -1.802612
H  -3.365793 0.602921 2.41491
H  -4.828176 2.888075 -1.809304
H  -3.821452 3.079323 2.41632
H  6.932169 -1.51841 -0.116575
H  5.889814 3.381774 0.204891
H  8.788636 0.124429 0.370083
H  8.260935 2.581998 0.560295
