program: Gaussian 09
title: 000213224
version: EM64L-G09RevD.01
frameworkgroup: C1[X(C18H16N2O3)]
method: RPBEPBE
basis: SDD
operation: Freq
keyword: #p
keyword: freq=noraman
keyword: PBEPBE/SDD
title: #p freq=noraman PBEPBE/SDD
converged: YES YES NO NO
title: Mulliken charges:
elementType: O O O N N C C C C C C C C C C C C C C C C C C H H H H H H H H H H H H H H H H
charge: -0.219540 -0.219335 -0.216071 -0.201994 -0.331914 -0.360092 -0.398109 0.135753 0.161393 -0.526380 0.478114 0.130875 0.278189 -0.350535 -0.411197 -0.213205 -0.204114 -0.339473 -0.343364 -0.249092 -0.246525 -0.229136 -0.222848 0.290384 0.257376 0.252842 0.253641 0.250051 0.339350 0.298199 0.233688 0.233463 0.231862 0.245300 0.277974 0.235310 0.230801 0.234368 0.233993
chargesum: 0.00000
title: Mulliken charges with hydrogens summed into heavy atoms:
elementType: O O O N N C C C C C C C C C C C C C C C C C C
charge: -0.219540 -0.219335 -0.216071 -0.201994 0.007436 -0.069708 0.112108 0.135753 0.161393 -0.022688 0.478114 0.130875 0.278189 -0.052336 -0.177509 0.020258 0.027748 -0.094173 -0.065390 -0.013782 -0.015724 0.005232 0.011145
polarizability: 2.31357568e+02 -3.69266900e+01 2.39322660e+02 -9.58565397e-01 1.75099332e+01 1.69241128e+02
1716.lowfreq: -5.6550 -5.0547 -0.0005 0.0006 0.0008 7.6609 12.2752 17.5111 27.7953
frequency: 11.6785 17.4821 27.7790 44.4082 58.9932 66.3014 82.7365 104.0845 131.9600 137.2411 159.7655 205.8317 219.0281 239.5503 287.3726 302.9153 313.9751 360.6131 381.1098 395.5858 399.7830 405.2032 416.6065 456.0968 478.9133 517.1860 562.5198 571.9602 581.6763 612.8996 613.4033 634.1130 639.8617 662.0684 693.2461 695.8661 712.6669 752.5351 762.1568 780.5993 791.8048 819.5906 835.7650 856.4135 858.3009 899.5273 910.9643 944.3366 971.5128 972.3488 983.8445 989.8197 990.8539 996.5666 1009.9471 1016.5245 1027.1098 1035.9063 1039.1902 1078.7255 1085.5341 1097.7516 1126.1711 1162.8554 1173.1077 1176.8627 1183.8203 1189.8143 1191.9057 1198.8931 1229.9926 1232.2863 1259.6916 1283.3357 1302.6194 1308.3052 1321.1740 1334.2551 1363.6262 1377.1904 1387.9573 1404.3331 1434.6127 1437.2110 1449.4318 1454.2356 1479.8427 1487.5008 1570.9556 1588.8214 1599.4901 1609.8555 1613.1137 1631.6883 1679.0877 2968.2753 3011.8680 3019.8605 3032.1010 3094.4803 3129.0400 3133.2509 3138.6835 3142.4517 3149.9421 3154.2490 3159.0424 3169.6974 3170.4764 3195.9209 3543.1772
redmass: 6.1050 5.0198 4.7317 4.6623 6.3119 6.6354 8.4320 2.7084 5.2419 7.0355 3.5630 2.7085 6.1101 5.2901 7.9106 7.7314 4.9077 6.5256 2.9075 5.4586 2.7987 3.0204 3.2351 2.5253 3.9434 2.5969 5.8817 2.4008 4.9231 6.3904 6.4402 6.4495 6.3260 4.7170 2.1096 1.8092 4.5763 1.6675 1.7009 5.1675 1.9700 4.4376 1.2764 2.1631 1.6801 2.4999 1.5392 1.4376 2.3521 1.8940 5.7040 6.1039 1.3882 1.3257 1.3664 3.0799 2.2003 1.9827 2.0558 2.2622 1.6040 2.2327 2.9795 1.3720 1.0855 1.0532 1.4345 1.1931 2.8250 1.1409 1.6794 1.9759 5.5979 2.4910 1.1780 1.6102 1.4091 1.3288 1.6086 4.7258 9.3555 2.6502 1.3416 1.6785 2.3908 1.0965 2.1981 2.3946 6.7536 6.3540 6.8152 5.9650 6.5376 11.2946 9.7470 1.0597 1.0798 1.0985 1.0627 1.1037 1.0851 1.0853 1.0880 1.0890 1.0924 1.0943 1.0961 1.1013 1.0999 1.0956 1.0804
irintensity: 0.3411 0.7754 0.2494 0.6843 0.5471 1.2789 7.5486 2.6484 0.1968 1.4959 0.2199 2.6980 1.2834 11.5747 18.4900 3.3697 1.6468 4.9055 25.0773 20.3441 0.0722 0.6213 1.4573 89.5966 16.8021 12.3442 9.5409 5.7901 16.6966 1.2382 0.3339 6.8065 4.8827 5.4673 32.0361 44.7857 16.1913 43.6622 86.4610 16.5044 6.8308 8.6631 0.7345 7.1399 4.0875 0.1749 9.7087 1.6350 18.8764 8.1380 0.5614 2.9538 0.6431 0.9426 0.7144 15.1101 1.0187 21.2069 0.8014 9.1879 6.6827 13.5080 4.7807 1.1536 6.8376 0.4858 42.5756 3.8724 21.3527 6.9553 21.9579 67.7439 182.1920 183.6430 5.0598 82.0471 55.3950 3.2067 30.9473 34.2533 2.2808 36.8169 8.5727 24.0206 6.7445 35.0611 1.6734 131.0123 93.0697 1.8841 51.8819 72.2098 10.2301 322.2542 275.7026 16.9858 5.3435 5.3417 9.3155 6.1592 0.2513 3.7970 5.2797 6.5726 18.3869 26.9580 21.3609 19.7275 16.9648 3.6134 32.5568
temp: 298.150 k
press: 1.00000 atm
elementType: 8 8 8 7 7 6 6 6 6 6 6 6 6 6 6 6 6 6 6 6 6 6 6 1 1 1 1 1 1 1 1 1 1 1 1 1 1 1 1
symmnumber: 1
zpe: 790532.2 jmol-1
zpe.correction: 0.301098 hartree
zpe.thermalcorrener: 0.321176 hartree
zpe.thermalcorrenthalpy: 0.322120 hartree
zpe.thermalcorrgfe: 0.248533 hartree
zpe.sumelectzpe: -1029.061501 hartree
zpe.sumelectthermal: -1029.041423 hartree
zpe.sumelectthermalent: -1029.040479 hartree
zpe.sumelectthermalfe: -1029.114067 hartree
dipole: -2.5378 5.0348 1.8565
dipole: 5.9360
quadrupole: -117.3166 -132.4730 -142.1416
quadrupole: 6.7082 -1.9883 7.5118
quadrupole: 13.3272 -1.8293 -11.4979 6.7082 -1.9883 7.5118
hfenergy: -1029.3625991 hartree
pointgroup: C01 [X(C18H16N2O3)]
dipole: -1.0307488 -1.9261241 -0.8256908 debye
polarizability: 232.0487154|37.2768564|236.4222248|2.0795882|20.7523042|171.4504161 unknown
InChI: InChI=1S/C18H16N2O3/c21-16(13-7-3-1-4-8-13)12-11-15-17(22)19-20(18(15)23)14-9-5-2-6-10-14/h1-10,15,19H,11-12H2
charge 0 multiplicity 1
39 atoms
O  -1.640351 1.048058 2.248872
O  -0.789265 3.175157 -2.0486
O  3.459946 1.865423 0.966996
N  -2.368772 0.752232 0.008113
N  -2.040351 1.351196 -1.253261
C  -0.77992 2.480288 0.376922
C  0.739013 2.337634 0.661296
C  -1.625181 1.378484 1.034328
C  -1.153508 2.424007 -1.109576
C  1.32421 0.99772 0.180116
C  -3.16689 -0.428839 0.050324
C  2.83402 0.902549 0.433402
C  3.554914 -0.354343 0.032533
C  -3.711234 -0.870708 1.287398
C  -3.430282 -1.155056 -1.142263
C  -4.514212 -2.028472 1.312649
C  -4.245193 -2.306412 -1.095614
C  2.888642 -1.463851 -0.555299
C  4.957575 -0.427651 0.254029
C  -4.793987 -2.749768 0.12804
C  3.611572 -2.621853 -0.912943
C  5.67861 -1.583214 -0.103638
C  5.006783 -2.684473 -0.6885
H  -1.103465 3.462884 0.772311
H  1.264877 3.174565 0.170101
H  0.901792 2.445666 1.74759
H  0.826466 0.149575 0.692793
H  1.143028 0.857402 -0.905392
H  -2.702933 1.260432 -2.026844
H  -3.49023 -0.319928 2.203442
H  -2.977286 -0.860431 -2.094525
H  -4.928431 -2.364656 2.269316
H  -4.441029 -2.860652 -2.019907
H  1.808854 -1.431765 -0.734334
H  5.452562 0.437264 0.708184
H  -5.425446 -3.643495 0.159458
H  3.091173 -3.473557 -1.364349
H  6.75903 -1.630633 0.070509
H  5.566499 -3.58448 -0.966875
