program: Gaussian 09
title: 000213194
version: EM64L-G09RevD.01
frameworkgroup: C1[X(C12H13N3S)]
method: RPBEPBE
basis: SDD
operation: Freq
keyword: #p
keyword: freq=noraman
keyword: PBEPBE/SDD
title: #p freq=noraman PBEPBE/SDD
converged: YES YES NO NO
title: Mulliken charges:
elementType: S N N N C C C C C C C C C C C C H H H H H H H H H H H H H
charge: 0.132450 -0.411830 -0.002504 -0.576121 -0.197803 -0.545104 0.408768 -0.719849 0.103403 0.229013 -0.442831 -0.405981 -0.153402 -0.352906 -0.259493 -0.216891 0.258321 0.233919 0.222539 0.279141 0.283795 0.272882 0.303869 0.237461 0.225983 0.220351 0.220715 0.326323 0.325786
chargesum: 0.00000
title: Mulliken charges with hydrogens summed into heavy atoms:
elementType: S N N N C C C C C C C C C C C C
charge: 0.132450 -0.107961 -0.002504 0.075988 0.060517 -0.088647 0.408768 -0.156913 0.103403 0.229013 -0.169949 -0.168520 -0.153402 -0.126923 -0.039142 0.003824
polarizability: 2.28427803e+02 1.15016191e+01 1.68663710e+02 -2.51358152e+01 1.07316141e+00 9.45844797e+01
1716.lowfreq: -5.3618 -2.9241 -0.0008 0.0006 0.0016 2.6736 27.7902 38.6300 61.7386
frequency: 27.5998 38.6021 61.7305 88.8188 129.4268 177.4167 220.5742 243.9782 303.4289 330.1988 349.5099 362.7843 415.6168 424.9594 444.7914 458.9493 503.8146 511.2827 534.6855 539.4589 574.8472 577.4267 583.6956 623.0606 648.8698 714.1110 749.1472 750.7443 756.9399 772.9691 795.9828 831.4858 851.2600 864.9990 868.2606 932.2005 933.6932 971.1348 998.3738 1011.3918 1023.1591 1066.5236 1093.8135 1118.1819 1129.0099 1146.3135 1168.5330 1183.3159 1232.1763 1240.2836 1247.3777 1256.6339 1286.0199 1296.4769 1310.2196 1331.0643 1350.8188 1390.0586 1420.6390 1447.0538 1459.0653 1463.1904 1482.1569 1562.4846 1586.5270 1600.7134 1631.2580 1674.0722 2990.0205 3021.1728 3041.6677 3051.7082 3120.4029 3122.5565 3129.9584 3143.9143 3161.9216 3216.9873 3553.1874 3613.4419 3704.8172
redmass: 5.6993 5.3563 4.6711 6.5223 4.6328 3.5056 4.0033 3.1144 3.2184 4.7329 2.9565 1.3345 2.6560 2.8178 1.3505 3.3432 1.3077 3.8940 5.2313 5.5574 3.9656 3.8261 6.1754 3.6727 4.8835 4.5428 1.3309 4.4625 4.3386 4.0347 1.5787 2.5184 1.5097 2.4082 2.9728 1.4026 2.4167 1.2975 1.8099 2.1302 2.0517 3.3407 1.6165 1.6771 1.4991 1.3723 1.1275 1.4817 1.6815 1.7004 1.9988 1.4586 1.6856 1.7698 1.6253 1.4696 1.6867 5.2411 2.3845 1.0857 4.0755 1.1055 3.0401 6.2033 6.1884 1.1807 6.8863 7.7378 1.0598 1.0820 1.0631 1.0989 1.1092 1.0848 1.0890 1.0953 1.1001 1.0983 1.0449 1.0809 1.1043
irintensity: 0.0656 0.3056 2.0810 0.0941 1.6306 4.6861 7.4615 0.0328 8.8839 1.7299 18.1554 120.3921 24.8944 28.4050 134.8292 3.2869 94.2995 2.1160 19.1325 3.6632 3.3794 24.8969 15.7621 5.7860 9.6166 1.6356 112.7848 4.0953 5.8660 12.8293 22.5645 1.0489 0.9476 7.7598 8.6502 3.2057 24.5748 0.0345 7.5069 11.5917 8.1697 6.7566 36.2063 16.0305 9.3034 14.3538 2.1165 31.7614 5.2769 11.9027 83.8066 4.3198 11.7659 1.4967 34.6999 21.0838 22.2901 32.5655 3.2793 14.2324 22.6492 8.1033 2.3972 3.4333 0.0880 47.2311 2.0331 520.1218 19.7874 11.4130 23.9806 20.7264 7.0576 1.8405 5.1327 37.8770 29.6746 0.9547 78.6518 58.3670 40.0302
temp: 298.150 k
press: 1.00000 atm
elementType: 16 7 7 7 6 6 6 6 6 6 6 6 6 6 6 6 1 1 1 1 1 1 1 1 1 1 1 1 1
symmnumber: 1
zpe: 604396.0 jmol-1
zpe.correction: 0.230202 hartree
zpe.thermalcorrener: 0.244263 hartree
zpe.thermalcorrenthalpy: 0.245207 hartree
zpe.thermalcorrgfe: 0.188098 hartree
zpe.sumelectzpe: -1026.257992 hartree
zpe.sumelectthermal: -1026.243932 hartree
zpe.sumelectthermalent: -1026.242987 hartree
zpe.sumelectthermalfe: -1026.300096 hartree
dipole: 0.3879 1.9392 -0.0849
dipole: 1.9794
quadrupole: -80.1093 -91.6933 -105.2761
quadrupole: -11.5519 -6.3836 -0.5039
quadrupole: 12.2503 0.6662 -12.9165 -11.5519 -6.3836 -0.5039
hfenergy: -1026.4881942 hartree
pointgroup: C01 [X(C12H13N3S1)]
dipole: 0.186353 0.756092 -0.0081769 debye
polarizability: 228.8921286|9.724159|167.5118924|-25.8999841|4.6958614|95.2719718 unknown
InChI: InChI=1S/C12H13N3S/c13-12-15-9(7-16-12)5-8-6-14-11-4-2-1-3-10(8)11/h1-4,6,9,14H,5,7,13H2
charge 0 multiplicity 1
29 atoms
S  3.951709 1.025687 0.678089
N  -1.939125 2.279908 -0.222694
N  2.902544 -1.331286 -0.24255
N  5.240462 -1.072461 -0.643846
C  1.730118 -0.554153 0.228363
C  0.982311 0.054851 -1.002323
C  -0.33098 0.704668 -0.652972
C  2.206302 0.541514 1.237455
C  -1.556135 0.028005 -0.2524
C  -2.546503 1.040628 0.011743
C  -0.608263 2.072263 -0.621378
C  -1.914939 -1.338745 -0.101209
C  4.017773 -0.665398 -0.158847
C  -3.861131 0.725897 0.422074
C  -3.224002 -1.659495 0.306905
C  -4.186048 -0.638166 0.567928
H  1.039983 -1.239023 0.754242
H  0.827986 -0.772122 -1.721351
H  1.661229 0.781547 -1.488103
H  1.557686 1.430545 1.210809
H  2.279693 0.151056 2.264553
H  0.041216 2.91075 -0.869136
H  -2.392982 3.185831 -0.133319
H  -1.187713 -2.132794 -0.306412
H  -4.605573 1.50555 0.619809
H  -3.515007 -2.70911 0.425938
H  -5.196472 -0.92005 0.88482
H  5.288448 -1.944902 -1.165918
H  6.096714 -0.593595 -0.382171
