program: Gaussian 09
title: 000213235
version: EM64L-G09RevD.01
frameworkgroup: C1[X(C20H12Cl4N2O3)]
method: RPBEPBE
basis: SDD
operation: Freq
keyword: #p
keyword: freq=noraman
keyword: PBEPBE/SDD
title: #p freq=noraman PBEPBE/SDD
converged: YES YES NO NO
title: Mulliken charges:
elementType: Cl Cl Cl Cl O O O N N C C C C C C C C C C C C C C C C C C C C H H H H H H H H H H H H
charge: -0.062524 -0.045192 -0.048823 -0.048323 -0.501919 -0.280499 -0.269091 -0.484637 -0.477130 0.067275 0.289487 -0.406623 0.258838 -0.331614 0.136544 0.129970 -0.393206 0.651914 0.667860 -0.421375 -0.259764 -0.427236 -0.261557 -0.108900 -0.194864 -0.106193 -0.194482 -0.258339 -0.256387 0.260924 0.286492 0.229911 0.407871 0.329939 0.342183 0.340475 0.259510 0.260983 0.263869 0.264171 0.390463
chargesum: 0.00000
title: Mulliken charges with hydrogens summed into heavy atoms:
elementType: Cl Cl Cl Cl O O O N N C C C C C C C C C C C C C C C C C C C C
charge: -0.062524 -0.045192 -0.048823 -0.048323 -0.111456 -0.280499 -0.269091 -0.076766 -0.147191 0.067275 0.289487 -0.145699 0.258838 -0.045122 0.136544 0.129970 -0.163294 0.651914 0.667860 -0.421375 0.082419 -0.427236 0.078918 -0.108900 0.064646 -0.106193 0.066500 0.005530 0.007784
polarizability: 4.91639673e+02 8.09766025e+00 3.56129649e+02 5.94450907e+00 6.99298218e-01 1.01264350e+02
1716.lowfreq: -4.4608 -1.3815 -0.0011 0.0010 0.0012 1.7043 3.2041 13.7237 26.2726
frequency: 2.9471 13.7165 26.2639 34.4057 37.4752 65.7076 80.4180 87.4674 95.0829 98.9307 102.8618 117.1059 145.7292 148.9925 167.6549 200.3551 222.4236 244.0923 255.6361 268.5451 293.3308 297.4930 309.2096 309.3656 310.0074 328.3835 334.1684 358.7478 381.6851 418.8313 422.2077 429.5102 431.7370 445.5358 448.1704 494.8542 511.9036 530.0304 544.7722 564.6299 575.6865 582.4151 589.9560 638.2087 666.4983 667.8491 679.6828 700.2776 711.0241 719.2336 721.6584 745.7285 764.5403 795.6280 796.5756 806.0487 833.0039 840.7563 852.7951 890.1996 890.9440 922.3191 923.1779 924.5388 935.5418 936.2521 947.1266 989.0484 1008.4015 1010.1420 1066.4448 1078.2773 1080.0816 1092.2797 1115.7665 1134.7213 1137.3504 1158.7145 1215.0753 1232.2720 1239.4233 1249.0796 1254.3487 1273.8272 1278.9025 1302.3160 1368.3505 1369.6448 1397.0818 1400.8311 1406.7881 1408.5183 1440.3924 1449.6724 1483.2563 1514.3600 1526.9289 1569.1369 1572.0465 1579.5443 1589.9994 1601.7481 1605.7429 1617.6258 1634.5595 3121.8227 3124.8249 3166.7747 3167.7507 3169.8453 3187.3239 3187.7479 3192.4234 3194.1671 3324.0574 3493.5935 3606.0569
redmass: 18.2544 11.7895 12.7240 7.8196 8.5178 14.1816 5.8756 7.6907 11.8671 16.1665 8.3886 7.1965 13.2996 5.3504 15.5429 11.1854 5.4016 6.2297 9.0808 8.1520 9.3286 7.0855 17.2153 6.7479 26.2400 8.6079 5.2676 1.1560 8.3918 6.6825 5.9855 3.7343 5.8856 3.2421 3.2958 8.3372 9.2423 4.2424 5.5356 8.0505 4.3013 4.7928 6.1038 7.6993 4.6617 5.1250 1.7993 7.5899 4.0773 7.3467 3.3675 4.5543 3.7537 1.3379 1.3283 7.1350 1.5363 8.1156 1.1791 6.7065 6.4722 1.3661 1.3693 5.7954 1.3558 1.3537 1.5308 1.3541 7.2191 7.0496 2.5957 1.8632 1.8898 3.1018 1.9787 1.3910 1.4206 1.1511 2.6378 2.6428 1.6314 1.4536 2.6927 2.2273 2.0363 1.4956 7.0964 7.0335 4.9357 7.1766 4.2324 4.1573 2.6921 3.0043 2.9062 2.6538 3.1470 8.6321 6.6729 4.1385 3.5761 7.8552 6.0176 5.1587 3.5392 1.0909 1.0905 1.0892 1.0891 1.0948 1.0977 1.0974 1.0932 1.0934 1.0804 1.0756 1.0666
irintensity: 1.1499 0.1074 0.3767 4.8598 2.3911 0.1744 1.7624 0.1737 2.6442 2.3019 0.6392 2.2018 1.5234 0.0328 2.5012 1.6076 1.2709 1.3190 0.8592 1.1922 16.8830 4.6375 0.4254 1.4240 0.8388 9.0763 3.6961 137.3784 1.0497 10.9435 9.5584 0.7583 1.1831 7.7243 27.2972 17.5006 45.3665 11.6457 4.2626 48.5940 0.5534 3.7573 9.3522 18.4229 5.9000 19.7783 45.7298 4.8748 0.6383 0.5368 4.0075 39.7559 12.0502 35.4219 45.8318 2.7850 16.0375 1.3700 120.2244 71.1171 36.5559 20.3040 24.1351 16.7167 11.6749 12.1416 19.2142 0.8604 43.1597 88.6794 104.7603 23.2275 29.7811 49.5723 102.0331 5.4962 3.0611 2.1224 194.6423 37.8189 15.7262 2.4307 102.9813 184.4249 44.0246 80.2260 73.4312 139.2140 55.5681 6.2656 123.1734 53.5178 32.5313 59.9889 378.6224 466.2192 520.2038 110.8119 85.2421 18.3388 69.7959 247.7615 99.6286 133.5278 79.3480 17.1180 9.4670 0.7269 0.3709 4.3510 0.2291 0.1496 27.6259 22.9428 161.1823 36.5860 97.6456
temp: 298.150 k
press: 1.00000 atm
elementType: 17 17 17 17 8 8 8 7 7 6 6 6 6 6 6 6 6 6 6 6 6 6 6 6 6 6 6 6 6 1 1 1 1 1 1 1 1 1 1 1 1
symmnumber: 1
zpe: 723903.1 jmol-1
zpe.correction: 0.275720 hartree
zpe.thermalcorrener: 0.301897 hartree
zpe.thermalcorrenthalpy: 0.302841 hartree
zpe.thermalcorrgfe: 0.213863 hartree
zpe.sumelectzpe: -2942.776496 hartree
zpe.sumelectthermal: -2942.750319 hartree
zpe.sumelectthermalent: -2942.749375 hartree
zpe.sumelectthermalfe: -2942.838354 hartree
dipole: 3.2716 -3.6634 0.4956
dipole: 4.9365
quadrupole: -196.4180 -174.6995 -200.2798
quadrupole: -30.5798 -1.1192 -0.6048
quadrupole: -5.9523 15.7663 -9.8141 -30.5798 -1.1192 -0.6048
hfenergy: -2943.0522163 hartree
pointgroup: C01 [X(C20H12Cl4N2O3)]
dipole: 1.3031684 1.3927126 -0.3663322 debye
polarizability: 482.2239126|-12.7350121|356.9166276|-57.5926265|3.9431338|109.893132 unknown
InChI: InChI=1S/C20H12Cl4N2O3/c21-11-2-4-14(23)16(8-11)25-19(28)10-1-6-18(27)13(7-10)20(29)26-17-9-12(22)3-5-15(17)24/h1-9,25-27H
charge 0 multiplicity 1
41 atoms
Cl 5.84297 1.928721 -0.922355
Cl -3.140672 -2.920806 0.043023
Cl 5.214569 -4.454896 -0.620427
Cl -8.416213 0.5106 1.324908
O  2.52671 2.997664 -0.45547
O  1.499835 -1.126719 -0.197895
O  -3.791371 2.349813 0.585396
N  3.234676 0.430443 -0.492673
N  -3.260683 0.081367 0.314966
C  0.908516 1.212723 -0.179456
C  -1.482027 1.774809 0.148098
C  -0.440247 0.829301 0.022945
C  1.193296 2.605612 -0.253311
C  -1.159624 3.156126 0.075662
C  1.90261 0.076997 -0.290196
C  -2.933669 1.437415 0.369937
C  0.165421 3.569037 -0.124571
C  4.337839 -0.440014 -0.625453
C  -4.526786 -0.514827 0.504215
C  5.63633 0.110436 -0.832703
C  4.229369 -1.859609 -0.562628
C  -4.640271 -1.931803 0.408102
C  -5.707897 0.22686 0.788106
C  5.385055 -2.643317 -0.704995
C  6.780461 -0.68896 -0.972813
C  -6.919281 -0.461306 0.961845
C  -5.859271 -2.601833 0.584124
C  6.665565 -2.095929 -0.909587
C  -7.029762 -1.861561 0.867472
H  -0.592478 -0.255467 0.085942
H  -1.972342 3.880811 0.183846
H  0.405849 4.638083 -0.181382
H  3.429729 1.444402 -0.550433
H  -2.509455 -0.583907 0.10857
H  3.245373 -2.303311 -0.40466
H  -5.642105 1.313183 0.862231
H  7.756293 -0.22164 -1.130124
H  -5.900807 -3.691206 0.502549
H  7.545388 -2.734638 -1.016855
H  -7.989055 -2.365317 1.008061
H  2.637559 3.978064 -0.493111
