program: Gaussian 09
title: 000213234
version: EM64L-G09RevD.01
frameworkgroup: C1[X(C24H24N2O5)]
method: RPBEPBE
basis: SDD
operation: Freq
keyword: #p
keyword: freq=noraman
keyword: PBEPBE/SDD
title: #p freq=noraman PBEPBE/SDD
converged: YES YES NO NO
title: Mulliken charges:
elementType: O O O O O N N C C C C C C C C C C C C C C C C C C C C C C C C H H H H H H H H H H H H H H H H H H H H H H H H
charge: -0.262523 -0.266060 -0.393288 -0.381846 -0.264701 -0.463275 -0.477106 0.140733 0.284219 -0.473791 0.133419 0.199420 -0.350553 0.480061 0.083530 0.498989 -0.343136 -0.440971 -0.335115 -0.441412 -0.350036 0.337241 0.335518 -0.348653 -0.341218 -0.350241 -0.345531 -0.245493 -0.243531 -0.683987 -0.685215 0.190191 0.277754 0.262147 0.315653 0.308730 0.220976 0.313770 0.218237 0.307701 0.253869 0.248536 0.250339 0.246289 0.210319 0.211045 0.208506 0.209219 0.394770 0.209548 0.232952 0.232468 0.208039 0.232011 0.231482
chargesum: 0.00000
title: Mulliken charges with hydrogens summed into heavy atoms:
elementType: O O O O O N N C C C C C C C C C C C C C C C C C C C C C C C C
charge: -0.262523 -0.266060 0.001482 -0.381846 -0.264701 -0.147622 -0.168376 0.140733 0.284219 -0.283600 0.133419 0.199420 -0.072799 0.480061 0.083530 0.498989 -0.080989 -0.219995 -0.021345 -0.223175 -0.042335 0.337241 0.335518 -0.094784 -0.092682 -0.099902 -0.099242 0.175871 0.174194 -0.009019 -0.013683
polarizability: 5.06842866e+02 -4.03730052e+00 4.02018021e+02 2.67521293e+01 -4.91778498e+00 1.54525471e+02
1716.lowfreq: -2.5605 -0.0014 -0.0007 0.0009 1.9671 2.9997 15.3359 21.1190 23.8604
frequency: 15.3268 21.0807 23.8068 31.7961 37.7715 52.2770 59.3567 66.6299 84.2992 85.6615 96.4294 113.0146 117.0703 117.9967 142.0530 152.8665 172.3630 182.8199 183.6613 205.4331 232.3228 244.8329 245.5565 271.4179 299.0092 317.8973 333.4129 336.7808 365.5821 377.9240 389.6779 409.6193 414.7264 415.5510 429.2643 434.1467 439.0497 447.6158 489.2798 519.4786 523.9367 527.1428 568.8203 574.7153 619.6108 625.2270 628.4645 630.2095 635.2635 663.7505 703.2678 720.1978 722.2408 727.8175 742.3306 749.0207 759.0720 799.4150 810.2143 811.9475 817.6238 822.5093 822.9983 841.9662 843.0787 843.3002 851.9713 861.9830 876.5588 901.6026 902.5862 924.3884 938.4024 942.9476 956.2192 971.3428 976.3756 988.8955 998.3771 999.0212 1036.0745 1037.5980 1067.6699 1086.2681 1115.0343 1115.3022 1123.0667 1124.3850 1136.2895 1136.3441 1138.8279 1177.9797 1180.1553 1217.9334 1219.9297 1224.1090 1241.3097 1253.1780 1259.2355 1261.9536 1263.7695 1275.0108 1288.4417 1307.1393 1315.3181 1345.5229 1363.5328 1366.6361 1373.0769 1382.0117 1399.1632 1400.3805 1403.6027 1415.4884 1419.9883 1428.3316 1461.1462 1461.9521 1474.4474 1476.5940 1477.7278 1486.8412 1487.3161 1500.2804 1503.1473 1506.2501 1526.1658 1546.2006 1587.4175 1592.9851 1596.3614 1600.4263 1626.6987 1628.7614 1641.8074 2738.7229 2953.6501 2956.7052 2997.0101 2998.0718 3011.6945 3015.6630 3094.4473 3095.3847 3095.7638 3105.7369 3107.0425 3110.9444 3112.1793 3157.9418 3160.2075 3162.8394 3168.3543 3170.9587 3180.2129 3194.7109 3201.4101 3529.4746 3542.9580
redmass: 5.4201 3.8848 4.3440 5.0835 3.9883 4.5628 4.5307 4.7143 5.1322 6.4922 4.8723 4.4833 1.8824 1.8196 5.8755 5.6237 4.6611 5.1545 5.4361 5.3709 5.8235 1.2171 1.2057 5.6426 7.0997 8.5567 3.9348 3.8657 4.7074 5.8202 6.0812 5.5235 3.1080 3.1534 4.5339 6.3597 4.0517 6.0344 4.6442 3.2695 2.3828 2.6337 6.0771 5.0295 1.2893 5.1142 1.4960 5.7338 6.0259 5.7761 6.4474 3.8855 3.6852 5.4283 4.7101 4.4376 3.6934 5.7405 1.2576 1.2266 5.3486 1.3294 1.3124 1.3532 2.1585 2.1000 1.5737 5.4154 1.9526 3.4403 3.3390 5.8145 1.3657 1.3583 1.0785 1.3196 1.2995 1.3595 2.7459 2.7620 2.8070 2.8402 3.1096 3.1207 2.0783 2.0968 1.3628 1.3599 1.4387 1.4399 1.4691 1.2519 1.2331 2.5056 2.4272 2.3095 1.9541 2.4911 2.0537 1.1418 1.1393 3.6467 2.1656 1.4634 1.5540 2.0700 1.8582 1.4357 2.4276 3.9452 1.2752 1.3772 3.6851 4.8909 4.1166 3.6185 1.0400 1.0397 1.6287 1.1901 1.2727 1.1834 1.1849 2.0616 2.1057 2.3691 2.3886 6.5466 6.9818 3.7463 4.2439 3.9395 6.4209 6.2821 4.4517 1.0703 1.0553 1.0554 1.0362 1.0363 1.1075 1.1076 1.0989 1.0989 1.0893 1.1014 1.1014 1.0899 1.0902 1.0888 1.0896 1.0899 1.0945 1.0945 1.0970 1.0949 1.0946 1.0759 1.0753
irintensity: 0.0727 0.0968 0.0109 0.0731 0.0674 0.1058 0.0150 0.9390 3.8595 19.1273 1.6236 2.7025 1.2525 1.8135 0.5056 0.3659 0.0074 0.6053 1.1533 0.1465 3.1451 1.0515 0.7487 5.0714 0.6422 3.1819 1.5528 1.0816 4.5575 1.3054 17.2802 4.2048 0.1207 0.1149 3.9924 5.7217 5.9887 2.8154 17.3716 17.4294 38.1694 32.5076 40.4921 35.9044 65.7990 8.7877 9.3855 3.1883 13.7751 25.4442 8.2762 2.5121 0.3065 13.2481 8.7047 14.6947 7.3302 4.5918 1.8235 0.1391 4.6818 81.2498 57.3002 32.8469 8.8574 26.5555 42.8429 10.4694 21.7114 87.3463 21.1504 4.6290 0.2007 0.6151 122.7741 4.5664 22.7282 2.9992 4.2820 6.3115 99.1617 76.3719 6.3232 36.0930 2.8117 0.3748 20.1449 28.7450 4.5077 4.7082 14.1626 207.4467 110.5206 358.9701 32.9316 424.0628 182.0738 82.4627 10.8146 0.0135 0.0076 168.5862 18.8917 33.5858 36.4396 149.3017 73.0517 20.3263 33.6230 0.9008 26.9191 78.3418 63.4925 58.9385 82.5240 25.4966 11.8958 12.2128 97.1468 21.3093 185.3087 99.6450 111.5933 133.8157 343.4844 259.3792 444.2746 81.0351 94.2357 40.8304 68.4024 41.0044 47.0802 22.8564 169.1921 715.1965 41.3542 39.1767 31.0014 29.5238 36.3522 34.8263 29.8147 27.7646 16.9729 34.9709 34.1869 22.8194 16.6577 0.2058 15.7012 14.5394 5.8429 4.9435 5.7103 7.6828 7.2465 7.1732 12.3563
temp: 298.150 k
press: 1.00000 atm
elementType: 8 8 8 8 8 7 7 6 6 6 6 6 6 6 6 6 6 6 6 6 6 6 6 6 6 6 6 6 6 6 6 1 1 1 1 1 1 1 1 1 1 1 1 1 1 1 1 1 1 1 1 1 1 1 1
symmnumber: 1
zpe: 1136119.5 jmol-1
zpe.correction: 0.432725 hartree
zpe.thermalcorrener: 0.461686 hartree
zpe.thermalcorrenthalpy: 0.462630 hartree
zpe.thermalcorrgfe: 0.369488 hartree
zpe.sumelectzpe: -1412.387329 hartree
zpe.sumelectthermal: -1412.358368 hartree
zpe.sumelectthermalent: -1412.357424 hartree
zpe.sumelectthermalfe: -1412.450565 hartree
dipole: 1.2861 -5.1678 0.5951
dipole: 5.3586
quadrupole: -134.5006 -196.0693 -186.3542
quadrupole: -4.4489 6.5760 2.6484
quadrupole: 37.8075 -23.7613 -14.0462 -4.4489 6.5760 2.6484
hfenergy: -1412.8200537 hartree
pointgroup: C01 [X(C24H24N2O5)]
dipole: 0.4931148 -2.036663 0.2311215 debye
polarizability: 508.5003042|-5.412586|401.9986411|9.4063057|-7.5181658|152.8874127 unknown
InChI: InChI=1S/C24H24N2O5/c1-3-30-19-10-6-17(7-11-19)25-23(28)16-5-14-22(27)21(15-16)24(29)26-18-8-12-20(13-9-18)31-4-2/h5-15,25-27H,3-4H2,1-2H3
charge 0 multiplicity 1
55 atoms
O  6.563078 -3.435898 -0.523055
O  -6.999223 -2.90412 0.718073
O  2.440925 4.706083 0.154164
O  3.617182 2.486296 0.173298
O  -3.598873 2.668957 -0.72871
N  2.495518 0.495038 -0.306751
N  -2.737594 0.816561 0.43532
C  1.210718 2.579417 -0.023418
C  -1.260134 2.695754 -0.092921
C  -0.063008 1.949933 -0.068777
C  1.259473 4.019691 0.042851
C  2.50738 1.847748 -0.041446
C  -1.181017 4.119976 -0.102213
C  3.587248 -0.425642 -0.341579
C  -2.626419 2.071987 -0.166614
C  -3.862364 -0.060169 0.461982
C  0.053391 4.769909 -0.022507
C  3.283886 -1.771126 -0.692584
C  4.927225 -0.073304 -0.043797
C  -3.728781 -1.274967 1.19172
C  -5.084848 0.214782 -0.201194
C  5.63326 -2.391403 -0.442451
C  -6.006535 -1.92028 0.588639
C  4.292508 -2.744037 -0.74326
C  5.942079 -1.053161 -0.093647
C  -4.786096 -2.195091 1.256212
C  -6.147877 -0.712748 -0.138356
C  7.976767 -3.125249 -0.222261
C  -8.294137 -2.664563 0.050119
C  8.758418 -4.425697 -0.38364
C  -9.179807 -3.868402 0.359412
H  -0.129412 0.854178 -0.110167
H  -2.115099 4.686629 -0.168506
H  0.129422 5.860465 -0.001447
H  1.591195 0.086723 -0.549403
H  -1.937972 0.510807 0.994035
H  2.251185 -2.058803 -0.930167
H  5.163064 0.959371 0.215881
H  -2.790128 -1.500591 1.71504
H  -5.194642 1.152119 -0.749057
H  4.068063 -3.779928 -1.013207
H  6.967597 -0.753559 0.140119
H  -4.691233 -3.129654 1.816846
H  -7.079618 -0.47398 -0.659253
H  8.054185 -2.733337 0.812741
H  8.338501 -2.346418 -0.92461
H  -8.130763 -2.553977 -1.041921
H  -8.74035 -1.725419 0.437586
H  3.19555 3.993836 0.215709
H  9.828864 -4.253412 -0.169704
H  8.665066 -4.811407 -1.413015
H  8.382103 -5.195403 0.311386
H  -10.168205 -3.745879 -0.119674
H  -9.328505 -3.972813 1.447641
H  -8.720012 -4.797321 -0.018757
