program: Gaussian 09
title: 000213296
version: EM64L-G09RevD.01
frameworkgroup: C1[X(C21H29N2O2S)]
method: RPBEPBE
basis: SDD
operation: Freq
keyword: #p
keyword: freq=noraman
keyword: PBEPBE/SDD
title: #p freq=noraman PBEPBE/SDD
converged: YES YES NO NO
title: Mulliken charges:
elementType: S O O N N C C C C C C C C C C C C C C C C C C C C C H H H H H H H H H H H H H H H H H H H H H H H H H H H H H
charge: 0.294522 -0.473285 -0.277163 -0.092623 -0.121238 -0.380386 -0.335236 -0.310048 -0.419395 -0.438149 -0.401245 -0.566543 -0.431770 0.215497 -0.632174 0.001574 0.356614 -0.239154 -0.350845 -0.372089 -0.272823 -0.141901 -0.237214 -0.238584 -0.499120 -0.227216 0.236539 0.337731 0.255099 0.257352 0.252800 0.262354 0.260345 0.223424 0.232126 0.256789 0.214095 0.256910 0.251846 0.247405 0.318804 0.255820 0.276694 0.210787 0.260073 0.321206 0.380746 0.262094 0.239435 0.266535 0.257721 0.240591 0.234428 0.276324 0.243917
chargesum: 1.00000
title: Mulliken charges with hydrogens summed into heavy atoms:
elementType: S O O N N C C C C C C C C C C C C C C C C C C C C C
charge: 0.294522 -0.092538 -0.277163 -0.092623 -0.121238 0.193884 0.177215 0.205106 0.064375 0.050765 0.069760 0.251511 0.100744 0.215497 0.159892 0.001574 0.356614 -0.239154 -0.088751 -0.132654 -0.006288 0.115820 0.003377 -0.004155 -0.222796 0.016701
polarizability: 2.75732900e+02 -1.06501761e+01 2.64606424e+02 1.24865415e+01 -4.75041725e+00 2.08215384e+02
1716.lowfreq: -17.8434 -8.1168 -6.7389 -0.0016 -0.0010 0.0008 8.5034 24.2345 27.5759
frequency: -11.9895 24.0991 27.3215 34.3162 44.5687 67.6795 73.7659 75.4591 100.6200 113.1498 137.3420 162.9135 171.4016 185.8250 190.0634 199.9439 230.4841 232.8196 264.4789 274.0574 277.8471 290.9468 305.9188 309.9901 323.6446 348.8746 354.6750 377.1321 404.0840 411.8817 428.8265 439.6309 448.9163 457.9731 467.0231 495.5294 525.7615 548.2791 553.1537 574.2106 612.8746 617.4730 623.8163 650.6300 653.4256 685.3553 704.0432 708.9730 715.3971 753.9748 772.8393 786.2598 804.8282 813.1250 841.0300 849.4944 854.3142 861.4588 863.1351 870.6161 883.5571 914.6042 925.7369 930.3951 936.0985 952.2668 963.8272 982.8616 988.7408 990.8574 995.6048 1006.7806 1028.2374 1046.1269 1046.7011 1061.1812 1076.0868 1082.1107 1090.9409 1102.5947 1111.0820 1119.2550 1122.0324 1131.0019 1152.1471 1163.7649 1177.5926 1180.4090 1191.4436 1193.4640 1199.7526 1220.3840 1224.4734 1260.0728 1263.9081 1281.3203 1298.1864 1307.4441 1317.2193 1317.5942 1332.9992 1341.2794 1349.8234 1354.4761 1367.8022 1373.0577 1380.0976 1382.8374 1388.3452 1391.9318 1431.8122 1436.0155 1443.6987 1444.8076 1453.6311 1457.2228 1469.7085 1469.9719 1472.9952 1473.3119 1476.4319 1478.7907 1479.7830 1484.8683 1496.5318 1507.9947 1540.9813 1558.2550 1592.3371 1609.6231 2981.6321 2992.6156 2997.9100 2998.3089 3003.5577 3004.2712 3015.7902 3025.5855 3029.1672 3057.4885 3059.9899 3063.0483 3072.9790 3076.7675 3085.6432 3089.3848 3106.2396 3126.1122 3134.5932 3139.1025 3140.9871 3149.9654 3159.1136 3161.9455 3171.4439 3173.8341 3186.5041 3239.6233 3540.6634
redmass: 3.5613 5.2004 4.0191 4.5446 5.5656 4.3706 4.3139 4.2203 4.8011 4.1482 2.6501 2.6193 1.1584 1.8327 1.9767 6.1119 4.0634 3.6206 4.6372 2.9365 2.2508 3.7982 1.9464 1.9821 2.8453 2.3489 2.7945 3.3930 2.7836 2.8073 3.5654 2.5243 2.7672 2.9795 3.1355 4.6421 2.9003 2.6386 1.9203 3.8375 6.0339 6.1955 7.1651 4.6475 4.1212 6.8623 1.9794 1.3252 3.4095 2.3875 1.6265 2.4571 3.3819 3.3451 1.3562 2.6971 1.2491 1.6857 5.3520 2.2846 2.4852 1.3832 2.1588 1.5871 2.1164 4.0696 1.9244 1.3883 2.4350 5.2284 2.0468 1.3312 2.2507 1.8329 1.8659 2.5129 2.4478 1.4122 1.3409 1.5811 1.8396 1.6317 1.3798 1.3452 2.8294 1.4414 1.0539 1.8063 1.4962 1.5546 2.9273 2.0036 1.3900 1.3807 1.5452 1.3258 1.4054 1.2273 1.3723 1.3618 2.2057 1.3183 1.4151 1.3857 1.3392 1.2660 1.2801 7.2368 1.3108 2.0936 1.1780 2.1699 1.1041 1.1884 1.0882 1.0820 1.0907 1.0881 1.6808 1.9355 1.3001 1.4802 1.3023 1.0813 1.0624 1.0850 5.6785 5.3794 6.1764 6.1047 1.0374 1.0688 1.0656 1.0642 1.0609 1.0620 1.0600 1.0595 1.0384 1.0987 1.0968 1.1017 1.1041 1.1042 1.0956 1.1070 1.1008 1.0867 1.1046 1.0876 1.0984 1.0927 1.0927 1.0950 1.1028 1.1007 1.0954 1.1006 1.0662
irintensity: 1.0001 0.2970 0.0142 1.7994 0.2751 0.1870 3.4109 1.0104 8.5657 2.4069 1.4855 1.1283 0.1503 0.8093 0.6519 3.4115 11.9513 6.0739 0.4394 15.5037 37.2687 2.7944 32.6016 29.0905 23.5432 0.4024 2.0402 5.2274 1.5382 12.8272 1.7327 3.7170 5.0363 3.4494 0.3292 1.1874 3.7415 9.1020 3.8980 5.0861 3.3359 1.5017 3.1968 11.5295 10.8402 4.4143 36.8682 75.0824 53.8434 86.6954 2.3293 8.6130 4.3831 6.3936 16.9098 12.0848 2.6024 1.7855 5.5857 17.5803 1.5642 2.4374 35.5382 23.8594 18.8480 51.0725 10.5271 0.8806 7.3165 3.2623 9.5793 0.3464 4.3661 3.8089 6.6330 1.4653 21.2069 3.9227 3.7817 19.3207 5.2244 59.3360 1.3687 16.4675 1.8452 9.9203 0.1273 2.0974 13.8241 3.7159 18.6755 15.6534 38.6574 32.4833 86.5120 25.9239 41.5258 2.4457 2.6228 2.0479 2.8717 2.1412 0.3819 0.1444 2.6090 3.5375 11.9471 3.4164 5.3178 15.5569 9.1812 13.5054 17.6876 9.4934 12.7446 12.0581 21.4502 24.5054 13.0247 1.0297 47.7581 5.9305 10.5448 37.6736 37.1288 44.1437 0.9585 187.0894 0.3149 0.2199 42.7849 8.8678 12.4659 21.1107 26.0569 38.9671 7.7891 8.8733 18.3843 8.3358 28.2038 32.9874 9.1861 27.2972 6.7831 17.3306 11.2199 8.9685 6.5152 1.8593 3.5097 17.2912 9.7483 12.4969 4.9844 13.4492 2.0827 1.4185 24.3374
temp: 298.150 k
press: 1.00000 atm
elementType: 16 8 8 7 7 6 6 6 6 6 6 6 6 6 6 6 6 6 6 6 6 6 6 6 6 6 1 1 1 1 1 1 1 1 1 1 1 1 1 1 1 1 1 1 1 1 1 1 1 1 1 1 1 1 1
symmnumber: 1
zpe: 1218164.6 jmol-1
zpe.correction: 0.463974 hartree
zpe.thermalcorrener: 0.488962 hartree
zpe.thermalcorrenthalpy: 0.489906 hartree
zpe.thermalcorrgfe: 0.409000 hartree
zpe.sumelectzpe: -1473.428727 hartree
zpe.sumelectthermal: -1473.403740 hartree
zpe.sumelectthermalent: -1473.402795 hartree
zpe.sumelectthermalfe: -1473.483701 hartree
dipole: -12.2657 -1.9296 -1.3750
dipole: 12.4924
quadrupole: -69.3081 -134.5120 -147.8956
quadrupole: -0.1332 8.6344 -6.0447
quadrupole: 47.9305 -17.2734 -30.6570 -0.1332 8.6344 -6.0447
hfenergy: -1473.8927015 hartree
pointgroup: C01 [X(C21H29N2O2S1)]
dipole: -4.8305193 -0.6452902 0.6370779 debye
polarizability: 271.8529186|19.2642603|225.091856|3.2996593|25.8915067|251.6099337 unknown
InChI: InChI=1S/C21H29N2O2S/c1-22(13-16-23(2)14-7-4-8-15-23)20(24)21(25,19-12-9-17-26-19)18-10-5-3-6-11-18/h3,5-6,9-12,17,25H,4,7-8,13-16H2,1-2H3
charge 1 multiplicity 1
55 atoms
S  3.622479 0.284599 2.325075
O  1.547174 -1.583478 1.117438
O  -0.420971 0.341827 -0.933639
N  -3.557401 -0.932382 0.105808
N  -0.669451 0.280125 1.362544
C  -3.553069 -0.177229 -1.250544
C  -4.965798 -1.547394 0.330316
C  -3.228367 -0.01523 1.309322
C  -4.661769 0.880705 -1.334238
C  -6.110296 -0.524956 0.215742
C  -6.05808 0.253555 -1.118965
C  -2.548101 -2.075422 0.022374
C  -1.997488 0.91141 1.209312
C  0.095859 0.128437 0.212528
C  -0.199995 0.090396 2.755666
C  1.599817 -0.298834 0.351618
C  2.218331 -0.577423 -1.031687
C  2.344244 0.763658 1.143154
C  3.24314 0.231239 -1.575199
C  1.765514 -1.706112 -1.76698
C  2.242533 2.144801 1.050806
C  3.16291 2.854333 1.907741
C  3.807727 -0.08156 -2.832528
C  2.331644 -2.019794 -3.01926
C  3.97258 2.014434 2.653286
C  3.356178 -1.205645 -3.55767
H  -3.717634 -0.96123 -2.012981
H  -2.534621 0.226106 -1.385484
H  -5.072806 -2.326639 -0.445331
H  -4.945477 -2.038757 1.319221
H  -3.139991 -0.690002 2.17998
H  -4.113713 0.620939 1.463907
H  -4.595572 1.342382 -2.336121
H  -4.485737 1.699281 -0.609924
H  -6.109121 0.174328 1.072736
H  -7.05539 -1.093492 0.294117
H  -6.284652 -0.433264 -1.958443
H  -6.837021 1.035165 -1.128602
H  -2.505156 -2.594875 0.99222
H  -2.87822 -2.774432 -0.761846
H  -1.564027 -1.668256 -0.238355
H  -2.117957 1.636407 2.038205
H  -2.006105 1.483974 0.267537
H  -1.033287 -0.298786 3.369357
H  0.147157 1.047144 3.187585
H  0.615618 -0.642677 2.782091
H  2.313234 -2.141803 0.822514
H  3.606878 1.099942 -1.018909
H  0.966614 -2.335883 -1.359024
H  1.541838 2.644976 0.375595
H  3.221367 3.943743 1.964564
H  4.603563 0.550147 -3.240885
H  1.977635 -2.89413 -3.576149
H  4.745089 2.264476 3.378486
H  3.79805 -1.44814 -4.529981
