program: Gaussian 09
title: 000213314
version: EM64L-G09RevD.01
frameworkgroup: C1[X(C19H19Cl2N3O8)]
method: RPBEPBE
basis: SDD
operation: Freq
keyword: #p
keyword: freq=noraman
keyword: PBEPBE/SDD
title: #p freq=noraman PBEPBE/SDD
converged: YES YES NO NO
title: Mulliken charges:
elementType: Cl Cl O O O O O O O O N N N C C C C C C C C C C C C C C C C C C C H H H H H H H H H H H H H H H H H H H
charge: 0.057430 0.063226 -0.249939 -0.324532 -0.220725 -0.209278 -0.247171 -0.261064 -0.234961 -0.282272 -0.230054 -0.380044 -0.642212 -0.190735 -0.225545 0.309987 -0.413389 0.108177 0.086392 0.143789 -0.361254 -0.081776 -0.175351 0.296103 0.087435 0.270260 0.504498 -0.795642 -0.776481 -0.726381 0.289075 -0.491515 0.314248 0.319739 0.272746 0.278423 0.314130 0.270441 0.253322 0.238781 0.264212 0.237796 0.213674 0.260853 0.260283 0.349213 0.246318 0.247380 0.229588 0.397576 0.335223
chargesum: 0.00000
title: Mulliken charges with hydrogens summed into heavy atoms:
elementType: Cl Cl O O O O O O O O N N N C C C C C C C C C C C C C C C C C C C
charge: 0.057430 0.063226 -0.249939 -0.324532 -0.220725 -0.209278 -0.247171 -0.261064 -0.234961 -0.282272 -0.230054 -0.065914 0.090587 0.123513 0.094193 0.309987 0.137781 0.108177 0.086392 0.143789 0.162509 -0.081776 -0.175351 0.296103 0.087435 0.270260 0.504498 -0.054853 -0.041671 -0.377168 0.289075 0.231770
polarizability: 3.86389180e+02 2.48215994e+01 3.08570339e+02 1.64963369e+01 -3.46465986e+01 2.03829945e+02
1716.lowfreq: -13.3722 -6.7699 -2.4626 -1.5487 -0.0006 0.0014 0.0015 8.7544 17.8593
frequency: -12.8187 8.7375 17.6348 19.3549 21.6388 27.7985 38.8515 54.2006 61.9629 66.4825 70.8806 73.2696 85.7705 100.1829 113.1577 124.7395 127.6458 131.6427 136.6145 152.4755 160.4410 181.9001 195.0314 208.6463 214.0136 221.4473 224.9873 228.5527 250.1999 252.9256 279.5509 296.3845 299.7722 304.5127 334.3358 342.2727 372.4181 383.3540 411.7859 423.3439 445.7013 478.4517 492.0771 493.5743 498.0635 519.3319 529.9157 567.9783 573.0162 594.2274 604.8113 605.6430 639.1106 648.3863 662.2178 675.4732 694.5057 701.1095 722.2541 730.6844 734.6733 742.5981 746.3252 765.2388 810.7807 819.1173 825.6821 846.0539 880.6162 884.0601 894.0554 926.8575 930.8471 983.9500 987.9763 991.9539 993.0931 1016.8835 1027.2325 1036.9975 1042.4558 1050.2886 1088.3139 1092.9459 1098.9922 1101.6587 1120.6420 1145.2187 1177.5681 1182.6872 1189.2050 1199.5086 1202.2534 1224.2688 1242.7502 1253.6296 1255.8890 1279.2481 1290.3113 1297.2199 1318.6449 1323.5942 1330.3666 1361.4544 1364.3069 1389.4185 1390.0498 1437.9783 1448.9085 1449.9602 1453.1412 1453.3364 1459.6785 1460.9752 1462.8983 1464.9341 1465.3046 1472.8944 1474.6813 1489.7615 1529.5574 1546.1539 1568.1016 1590.5242 1601.5259 1624.3550 1659.0786 1700.9157 2985.6146 2998.6585 2998.7275 3010.4860 3033.1482 3047.0253 3059.8784 3070.2976 3100.6986 3102.4080 3110.2355 3113.2004 3119.4500 3125.6280 3134.8566 3156.1369 3451.4927 3544.5649 3674.8022
redmass: 19.6074 9.5626 6.0280 7.7836 6.2742 7.6141 3.6336 2.9689 1.6809 5.9548 3.3680 4.2349 4.6412 10.5834 2.6143 4.3764 4.7116 1.7350 6.8319 4.2687 7.4862 6.8831 7.6805 4.5142 3.6976 1.6734 3.0458 4.3779 4.1154 9.1731 5.4697 3.9932 8.3680 5.5025 6.2396 6.0876 9.2803 3.8692 5.0712 4.7584 4.9781 4.1185 4.3188 5.1308 6.4653 5.2559 1.1043 1.6182 5.8717 4.7059 6.5061 2.4722 7.2618 6.3427 6.9763 6.0393 6.3348 9.9947 5.6171 1.2399 7.3897 6.9793 5.6163 5.5007 8.0942 6.3656 6.5495 4.6981 4.1947 3.6778 3.1044 5.1556 7.1574 3.2132 2.0609 2.5919 1.6784 3.6181 7.2841 1.4971 1.6764 2.3458 2.2760 2.7380 2.6816 1.2433 2.7484 1.4442 1.2970 1.1755 4.4411 1.0704 3.0008 1.5204 1.9716 2.3617 2.5437 1.7174 1.3445 2.6891 4.0634 1.6679 1.6004 2.1112 3.0850 1.2228 1.2489 1.2070 1.0468 1.0967 2.3770 1.2037 1.1814 2.1441 1.4410 1.3866 1.0620 1.6915 1.9367 2.4459 8.8299 9.1584 8.2673 9.5795 1.2621 6.2267 6.9246 8.8300 1.0370 1.0577 1.0362 1.0278 1.0639 1.1034 1.0963 1.0856 1.0989 1.0998 1.0994 1.1016 1.0892 1.1051 1.1067 1.0890 1.0554 1.0780 1.0969
irintensity: 0.2038 0.2330 3.0066 0.7806 1.6290 0.4259 9.6330 6.4327 0.6789 1.1402 2.0312 1.2326 0.3102 1.3438 0.6972 1.3114 2.4193 2.9140 3.2347 4.5300 8.6171 5.3694 4.3719 2.4407 10.9605 0.6051 1.2544 4.3606 12.3527 1.3753 5.0607 3.2898 1.5138 2.7948 0.6810 3.4029 30.8063 5.7787 10.3953 31.5562 4.6835 4.1254 8.1581 19.3690 3.6375 1.0754 108.0364 67.8443 3.7972 3.8943 72.1603 9.4506 5.2248 25.7232 15.6356 11.4143 15.9435 22.1026 3.8539 122.1188 3.2056 57.9791 9.0334 1.9103 5.8730 44.9997 141.3628 59.8975 21.7135 6.8621 6.1811 3.0897 95.0945 13.1172 6.7820 9.6886 1.1518 140.7202 239.9229 1.2813 10.6993 2.3689 81.0891 412.8698 120.3787 0.3097 53.7464 15.4816 8.6869 9.4280 9.8817 10.2497 63.5594 4.9255 149.7999 70.8022 150.7081 99.6564 131.1315 322.3594 169.3843 27.6571 12.4237 24.5795 7.8575 76.1204 40.5596 20.8472 14.0309 52.8599 11.8914 11.3132 23.0486 223.7625 37.9111 63.3811 15.0706 29.3897 114.6705 83.1033 206.9981 426.0087 1.4150 10.3626 224.8000 173.9936 154.8613 345.9547 17.5070 23.8802 7.9773 46.5355 7.1596 6.7466 13.0860 16.3648 9.2359 13.0666 3.5196 3.1744 9.8834 21.3373 35.5655 0.6050 214.0479 13.7377 131.6929
temp: 298.150 k
press: 1.00000 atm
elementType: 17 17 8 8 8 8 8 8 8 8 7 7 7 6 6 6 6 6 6 6 6 6 6 6 6 6 6 6 6 6 6 6 1 1 1 1 1 1 1 1 1 1 1 1 1 1 1 1 1 1 1
symmnumber: 1
zpe: 965418.1 jmol-1
zpe.correction: 0.367708 hartree
zpe.thermalcorrener: 0.399725 hartree
zpe.thermalcorrenthalpy: 0.400669 hartree
zpe.thermalcorrgfe: 0.298784 hartree
zpe.sumelectzpe: -2419.252476 hartree
zpe.sumelectthermal: -2419.220459 hartree
zpe.sumelectthermalent: -2419.219515 hartree
zpe.sumelectthermalfe: -2419.321400 hartree
dipole: -3.0913 1.4279 0.7749
dipole: 3.4922
quadrupole: -201.8929 -212.5020 -193.7609
quadrupole: 0.2306 3.9886 21.1977
quadrupole: 0.8257 -9.7834 8.9577 0.2306 3.9886 21.1977
hfenergy: -2419.6201839 hartree
pointgroup: C01 [X(C19H19Cl2N3O8)]
dipole: 1.0408161 -0.7657693 0.4669511 debye
polarizability: 393.5611579|3.7384859|309.0820299|3.6901373|25.3527088|196.1462763 unknown
InChI: InChI=1S/C19H19Cl2N3O8/c1-6-13(26)12-10(14(27)15(6)30-3)8(5-31-19(22)29)11-16(32-18(28)17(20)21)9(4-24(11)12)23-7(2)25/h9,16-17,23H,4-5,22H2,1-3H3
charge 0 multiplicity 1
51 atoms
Cl -5.127263 0.820444 -3.172296
Cl -3.641931 3.500357 -2.981724
O  -2.156417 0.321503 -1.399788
O  -0.704497 2.529642 0.728871
O  2.445614 -3.388058 -1.244165
O  3.811427 1.76126 0.319176
O  5.884898 -0.180101 -0.427925
O  -4.251057 -3.007188 0.763385
O  -3.59538 1.816794 -0.308176
O  -0.258726 4.172726 2.367791
N  0.427977 -1.311545 -0.487643
N  -2.070494 -2.336415 1.214743
N  -2.441647 3.696454 1.619991
C  -1.857299 -1.794465 -0.130484
C  -1.63213 -0.241596 -0.079173
C  -0.147901 -0.102847 -0.059842
C  -0.564905 -2.362815 -0.800223
C  0.88136 0.826779 0.183482
C  1.793656 -1.188784 -0.530321
C  2.106838 0.129617 -0.116469
C  0.742017 2.244025 0.653795
C  2.789722 -2.202264 -0.896303
C  3.49314 0.579583 -0.045064
C  4.201087 -1.757153 -0.83277
C  4.529216 -0.459338 -0.438856
C  -3.286003 -2.921932 1.577876
C  -3.118476 1.312119 -1.342191
C  5.275944 -2.746714 -1.208016
C  -3.362004 -3.444041 3.006119
C  -3.509592 1.66749 -2.779838
C  -1.080524 3.547963 1.653381
C  6.467009 1.130993 -0.051221
H  -2.768858 -2.036483 -0.7024
H  -2.177248 0.25916 0.732552
H  -0.676875 -2.459748 -1.893983
H  -0.256784 -3.337749 -0.394085
H  -1.310403 -2.285873 1.896098
H  1.208652 2.409101 1.643097
H  1.226373 2.950352 -0.045975
H  5.87767 -2.374811 -2.057708
H  4.817449 -3.710082 -1.480793
H  5.982634 -2.900746 -0.371906
H  -2.427682 -3.311403 3.578164
H  -4.180713 -2.926408 3.535006
H  -3.618376 -4.516964 2.982947
H  -2.777852 1.300904 -3.50734
H  6.109367 1.929518 -0.719672
H  6.215908 1.391621 0.988618
H  7.549322 0.969424 -0.169889
H  -3.016267 3.117845 0.998613
H  -2.860074 4.40415 2.217132
