program: Gaussian 09
title: 000213177
version: EM64L-G09RevD.01
frameworkgroup: C1[X(C15H28N2O5)]
method: RPBEPBE
basis: SDD
operation: Freq
keyword: #p
keyword: freq=noraman
keyword: PBEPBE/SDD
title: #p freq=noraman PBEPBE/SDD
converged: YES YES NO NO
title: Mulliken charges:
elementType: O O O O O N N C C C C C C C C C C C C C C C H H H H H H H H H H H H H H H H H H H H H H H H H H H H
charge: -0.323199 -0.240119 -0.442283 -0.261223 -0.300620 -0.197479 -0.371580 0.406331 -0.396042 -0.485151 -0.394953 -0.774348 -0.415152 -0.700288 0.275448 0.205303 -0.427474 0.305988 -0.059657 -0.679602 -0.665973 -0.663702 0.185453 0.220647 0.281564 0.254447 0.256055 0.219903 0.213464 0.222951 0.240239 0.249257 0.203622 0.213154 0.201280 0.216594 0.247072 0.246515 0.315088 0.248089 0.232331 0.225778 0.210293 0.399988 0.235720 0.199749 0.215668 0.200696 0.214493 0.235664
chargesum: 0.00000
title: Mulliken charges with hydrogens summed into heavy atoms:
elementType: O O O O O N N C C C C C C C C C C C C C C C
charge: -0.323199 -0.240119 -0.042295 -0.261223 -0.300620 -0.197479 -0.056492 0.406331 0.010058 0.050859 0.081005 -0.097695 0.037728 -0.069260 0.275448 0.205303 0.066113 0.305988 0.188433 -0.011200 -0.014836 -0.012849
polarizability: 2.38898209e+02 -1.23256868e+01 1.73738763e+02 1.09866940e+01 -1.22846749e+01 1.75076933e+02
1716.lowfreq: -21.5844 -7.0903 -4.0099 0.0005 0.0005 0.0007 5.2611 6.4596 13.0574
frequency: -21.2947 5.6644 12.2781 25.9545 34.7710 45.8771 62.4995 72.1560 83.2975 99.0103 106.2841 114.6913 128.3524 134.7605 162.4085 194.8485 197.4183 203.1369 216.4463 222.5499 225.4089 238.8423 243.8696 259.6052 278.0201 292.8568 307.3796 328.6262 347.5903 355.7192 386.7059 410.4240 429.4696 435.4737 442.1756 460.9132 513.8644 543.7099 546.8563 565.5680 575.5955 606.0713 644.4341 661.0849 690.9909 707.3590 734.5187 748.1698 760.3051 801.2827 836.4510 856.8879 862.5530 868.3983 888.9319 918.2565 919.7374 930.5827 937.9248 953.0554 967.6349 995.1789 1011.1350 1025.2886 1034.4979 1048.9417 1054.6962 1079.3778 1082.9697 1100.6987 1119.8013 1142.2957 1147.2159 1180.3506 1183.6060 1191.2669 1195.4241 1202.2705 1211.8965 1249.6168 1263.1390 1268.9527 1305.4890 1314.9501 1321.6126 1325.4381 1333.1837 1337.8173 1356.3703 1362.9591 1369.0687 1377.5512 1379.5330 1387.5728 1390.9448 1394.0264 1396.2398 1424.9884 1448.2967 1459.8192 1463.4304 1463.8019 1464.7683 1468.0820 1469.8812 1473.8179 1476.7646 1478.7161 1478.9710 1481.9878 1482.6373 1488.5342 1494.1686 1596.4270 1649.9359 1665.6354 2966.5101 2969.6148 2976.1089 2979.3890 2981.3885 2984.7979 2997.8741 3010.0986 3013.0097 3022.0957 3040.2442 3042.7780 3044.8849 3058.6982 3068.4239 3068.7695 3071.8262 3073.8257 3081.6822 3082.0011 3090.0160 3090.1070 3094.1644 3094.5464 3105.3247 3115.4438 3543.5584 3552.4850
redmass: 2.6772 4.0318 4.9505 5.2194 3.6271 5.7164 4.9344 3.6338 5.2382 3.0405 2.5933 1.7071 4.1283 3.5167 4.5317 2.8101 1.0390 1.2294 2.8392 1.3837 1.3992 1.5184 1.5059 2.7910 3.0908 4.6226 4.2181 2.4661 2.7398 4.2860 2.9103 2.6231 3.0612 2.3917 2.2744 5.4075 3.0163 2.6661 1.9151 1.6039 1.2214 4.1472 5.2760 4.9323 12.1276 6.8675 3.7064 1.3100 2.6656 1.4146 2.8058 2.0334 1.5199 2.3557 2.9034 1.9346 1.2600 2.2363 1.3669 2.3701 2.3332 1.4946 3.1747 1.9736 3.5289 2.4612 2.0452 1.6391 2.2973 2.2878 2.2784 2.3424 2.0745 2.2930 2.3575 2.4628 2.5196 2.3782 2.5004 1.1651 1.2961 1.4001 1.2896 1.3718 1.3008 1.3713 1.6960 1.3367 1.4350 1.4205 1.4478 1.2152 1.6574 1.2109 1.2149 1.2234 1.2208 1.1333 1.0842 1.0823 1.0494 1.1160 1.0501 1.0405 1.1366 1.0594 1.0513 1.0549 1.0505 1.0521 1.0538 1.0950 1.4983 7.8122 7.5006 9.5813 1.0578 1.0389 1.0362 1.0370 1.0522 1.0450 1.0360 1.0586 1.0627 1.0952 1.0863 1.0990 1.0615 1.0976 1.0991 1.1009 1.1000 1.0987 1.1029 1.0994 1.1003 1.1004 1.0999 1.1001 1.1000 1.1036 1.0643 1.0767
irintensity: 0.0651 0.1432 0.2270 1.3872 0.2102 4.2487 5.7164 1.2973 0.3879 1.5129 0.6489 0.8213 2.9832 0.3061 0.5000 2.1049 0.0342 0.5628 3.1674 1.0252 0.8742 0.7485 1.0224 5.0964 5.6785 6.5146 6.2071 0.4052 3.5065 23.6580 15.7091 1.2237 11.5237 8.6767 4.1337 2.7252 2.5142 24.0212 62.9438 62.2709 111.3326 33.9010 32.9145 0.9520 21.0332 20.5700 6.1875 11.1293 4.4150 14.1349 7.8475 8.9694 3.5916 16.5638 0.5438 9.5001 4.8466 19.4184 0.0062 24.7837 40.9388 9.8715 114.7643 3.1271 332.0236 96.9608 46.5567 1.0493 39.5146 3.4642 93.0655 18.3598 43.2044 20.7308 12.5134 257.2103 60.8228 157.7190 42.6481 0.1475 3.8875 0.1687 6.0075 34.0769 28.9911 4.9930 27.4642 44.4296 15.1851 11.2891 27.0372 19.0248 54.2061 12.5184 31.8345 25.5671 19.8762 76.0979 44.4602 8.0768 0.9989 13.1438 5.2813 12.6901 107.7013 17.7950 16.4275 7.2622 37.0127 9.0323 29.7755 15.0236 204.2273 309.8784 180.2599 296.5362 20.9028 47.1842 20.5387 31.5989 8.7690 36.5484 35.4250 36.7739 7.5304 12.7112 1.8367 3.0397 10.6676 1.6429 6.4536 67.8730 51.4192 46.8802 10.2147 63.6584 12.7959 36.4979 28.7401 44.8044 30.0569 0.7949 62.5424 25.7432
temp: 298.150 k
press: 1.00000 atm
elementType: 8 8 8 8 8 7 7 6 6 6 6 6 6 6 6 6 6 6 6 6 6 6 1 1 1 1 1 1 1 1 1 1 1 1 1 1 1 1 1 1 1 1 1 1 1 1 1 1 1 1
symmnumber: 1
zpe: 1108922.8 jmol-1
zpe.correction: 0.422366 hartree
zpe.thermalcorrener: 0.448266 hartree
zpe.thermalcorrenthalpy: 0.449210 hartree
zpe.thermalcorrgfe: 0.362829 hartree
zpe.sumelectzpe: -1072.292856 hartree
zpe.sumelectthermal: -1072.266956 hartree
zpe.sumelectthermalent: -1072.266012 hartree
zpe.sumelectthermalfe: -1072.352393 hartree
dipole: -0.7204 -2.9436 1.7143
dipole: 3.4817
quadrupole: -120.2761 -132.9859 -135.5353
quadrupole: -5.4325 -10.6491 -0.6353
quadrupole: 9.3230 -3.3868 -5.9362 -5.4325 -10.6491 -0.6353
hfenergy: -1072.715222 hartree
pointgroup: C01 [X(C15H28N2O5)]
dipole: 0.3117741 -0.1301122 -1.3275051 debye
polarizability: 237.8307443|-4.4528127|163.268627|17.5143173|-5.3982225|186.614535 unknown
InChI: InChI=1S/C15H28N2O5/c1-6-8-15(5,10-22-13(19)16-11(3)4)9-17(14(20)21)12(18)7-2/h11,16,20H,6-10H2,1-5H3
charge 0 multiplicity 1
50 atoms
O  -1.732916 -0.870925 0.760632
O  3.510116 -1.521071 1.297229
O  3.396124 0.194815 -2.463037
O  1.10826 -0.154883 -2.449224
O  -3.361363 0.707407 1.447215
N  2.360936 -0.600259 -0.499814
N  -3.724286 -0.800156 -0.322786
C  0.488774 0.24169 1.077196
C  0.128977 1.459195 0.171276
C  1.086273 -0.926135 0.221041
C  -0.772975 -0.347221 1.764134
C  1.459344 0.658962 2.214054
C  -0.506305 2.681567 0.877135
C  -0.819781 3.812846 -0.127568
C  3.594179 -0.923631 0.191588
C  2.201575 -0.189768 -1.832842
C  4.947553 -0.534755 -0.397191
C  -2.992754 -0.228959 0.688712
C  -5.098405 -0.373798 -0.661569
C  6.101411 -0.863827 0.566629
C  -6.090702 -1.544613 -0.476393
C  -5.150366 0.206327 -2.093578
H  1.058582 1.799064 -0.330844
H  -0.544905 1.115099 -0.637457
H  0.346196 -1.229334 -0.53519
H  1.31001 -1.781065 0.880259
H  -1.287288 0.409755 2.380978
H  -0.499709 -1.213344 2.394195
H  2.34387 1.177936 1.801606
H  0.967531 1.352341 2.919753
H  1.822351 -0.218313 2.776775
H  -1.4441 2.383712 1.382674
H  0.177431 3.069871 1.657113
H  -1.536228 3.467684 -0.89669
H  0.095757 4.151885 -0.649827
H  -1.265606 4.688196 0.379494
H  4.934445 0.53909 -0.656618
H  5.084798 -1.052196 -1.364402
H  -3.280345 -1.545593 -0.86256
H  -5.340931 0.425236 0.061354
H  6.130331 -1.940634 0.803104
H  5.993224 -0.322898 1.522219
H  7.064052 -0.576695 0.106697
H  3.160135 0.448062 -3.394374
H  -6.049444 -1.933931 0.555665
H  -5.86019 -2.374681 -1.17182
H  -7.123357 -1.209619 -0.682603
H  -4.882613 -0.562192 -2.843984
H  -6.169143 0.565464 -2.32675
H  -4.449529 1.052591 -2.199302
