program: Gaussian 09
title: 000213166
version: EM64L-G09RevD.01
frameworkgroup: C1[X(C7H11Cl3NO3P)]
method: RPBEPBE
basis: SDD
operation: Freq
keyword: #p
keyword: freq=noraman
keyword: PBEPBE/SDD
title: #p freq=noraman PBEPBE/SDD
converged: YES YES NO NO
title: Mulliken charges:
elementType: Cl Cl Cl P O O O N C C C C C C C H H H H H H H H H H H
charge: -0.068240 0.023700 0.023360 1.426095 -0.513294 -0.497398 -0.598275 -0.711741 -0.438533 -0.225717 -0.528906 -0.017054 0.181368 -0.539113 -0.407935 0.364143 0.253475 0.234419 0.236773 0.275474 0.265243 0.287014 0.228281 0.296653 0.223742 0.226467
chargesum: 0.00000
title: Mulliken charges with hydrogens summed into heavy atoms:
elementType: Cl Cl Cl P O O O N C C C C C C C
charge: -0.068240 0.023700 0.023360 1.426095 -0.513294 -0.497398 -0.598275 -0.347598 0.049361 0.286530 0.023350 0.211227 0.478021 -0.088904 -0.407935
polarizability: 1.67235673e+02 6.72213618e+00 1.47591567e+02 3.40520122e+00 7.65885039e+00 1.15047500e+02
1716.lowfreq: -14.6370 -9.0675 -0.0021 0.0005 0.0021 9.0981 11.9285 19.1333 22.6760
frequency: 3.7175 18.8383 22.3624 26.6760 46.4371 52.2189 64.3156 87.7614 112.8034 143.9401 155.8800 167.0628 188.9556 225.4629 239.4797 267.9482 294.9976 312.2415 330.3982 367.1092 388.5885 415.3361 419.0177 429.4021 474.1369 492.7251 579.2086 596.5145 637.5392 651.5436 658.3546 792.2342 842.0345 864.0526 876.6116 905.8632 940.3049 947.8407 966.3668 992.2353 1002.2758 1051.3791 1069.7983 1080.6521 1099.4417 1141.5452 1170.7779 1218.9798 1248.5429 1282.2018 1287.1172 1296.2621 1333.9507 1360.4627 1392.6313 1427.2567 1427.8026 1456.3963 1456.8483 1656.0231 1658.9358 3004.0985 3004.8616 3063.3617 3066.4639 3085.5332 3090.4502 3112.5442 3140.7058 3153.1588 3201.5680 3509.5885
redmass: 7.0825 9.2399 11.8791 5.6859 4.7739 5.7898 3.6375 4.2847 5.2520 5.1685 8.9018 9.8559 5.0608 4.5122 5.3177 6.9617 7.4226 4.3444 4.3950 2.4945 7.8881 3.7668 3.9635 2.1844 3.7473 1.5386 6.9065 5.4377 5.0770 2.2691 4.4697 4.4335 1.3272 2.1754 10.9355 1.5279 2.4941 1.9472 1.3471 1.9875 1.1956 5.8341 2.4417 8.8720 6.7853 2.0310 1.2348 1.1591 1.1938 1.1487 1.2455 1.1820 1.2009 1.2436 1.2165 1.1747 1.1032 1.0760 1.0829 4.6156 8.5458 1.0596 1.0599 1.0592 1.1029 1.1033 1.0605 1.0956 1.0930 1.1101 1.1148 1.0780
irintensity: 0.9431 0.3668 0.5036 0.5225 2.1729 4.9944 1.6844 1.5832 2.5481 1.4500 1.7392 1.8402 1.8967 1.0185 1.1874 19.2354 13.5598 5.5307 3.7397 9.5734 9.6396 10.4093 29.0402 10.4756 25.0802 131.6846 20.8613 36.5530 73.4950 49.5078 200.5345 55.5902 21.7522 87.0403 175.6517 7.3671 75.7798 60.1844 73.2117 95.0509 31.5134 129.8250 78.2868 372.1019 113.2251 12.7751 0.4849 1.1278 25.6820 17.9607 0.6812 15.5468 3.8142 4.6719 58.5191 11.6324 13.9843 5.3563 23.9637 3.3986 24.8319 38.1453 24.2329 19.8581 5.1241 2.1866 8.7120 9.1394 38.6026 5.0403 17.8740 117.0291
temp: 298.150 k
press: 1.00000 atm
elementType: 17 17 17 15 8 8 8 7 6 6 6 6 6 6 6 1 1 1 1 1 1 1 1 1 1 1
symmnumber: 1
zpe: 469834.1 jmol-1
zpe.correction: 0.178950 hartree
zpe.thermalcorrener: 0.198069 hartree
zpe.thermalcorrenthalpy: 0.199013 hartree
zpe.thermalcorrgfe: 0.124459 hartree
zpe.sumelectzpe: -2273.915941 hartree
zpe.sumelectthermal: -2273.896823 hartree
zpe.sumelectthermalent: -2273.895878 hartree
zpe.sumelectthermalfe: -2273.970432 hartree
dipole: -2.9158 -1.1527 -1.0155
dipole: 3.2957
quadrupole: -117.1354 -105.1361 -124.2792
quadrupole: 6.8175 0.2237 -11.9345
quadrupole: -1.6185 10.3808 -8.7623 6.8175 0.2237 -11.9345
hfenergy: -2274.0948914 hartree
pointgroup: C01 [X(C7H11Cl3N1O3P1)]
dipole: 0.8243134 0.8844635 -0.4685135 debye
dipolederiv: -0.3164431 0.0459848 0.1580954 0.0950236 -0.3253334 -0.0910531 0.1718517 0.0000961 -0.3519767 -0.5359566 -0.3240397 0.0304347 -0.396087 -0.2826611 0.1311482 0.1035204 0.1727278 -0.1472048 -0.1366292 -0.062525 -0.0432667 -0.0206234 -0.2182286 0.3248202 -0.1254265 0.2763957 -0.486426 2.7148477 -0.1668733 0.2588542 0.076631 2.2766781 -0.1418323 0.4304992 0.3094095 1.6085564 -0.5810108 0.3094925 -0.0867287 -0.0088781 -1.5802303 0.2380079 -0.0351195 0.4131874 -0.5850194 -2.0728803 -0.440414 -0.5753144 -0.8326495 -0.7490796 -0.21647 -0.1982376 -0.0591943 -0.4601665 -0.744044 0.0637451 -0.0334613 -0.0097169 -0.6097763 0.0556914 -0.105285 -0.0354748 -0.6614879 -0.9587775 0.1725625 -0.0710012 0.0296658 -1.0706616 -0.0241832 0.0488955 -0.2257973 -0.6498572 0.3116297 -0.0648928 -0.0058671 -0.3227806 0.7434468 0.0634009 0.1305256 0.0582423 0.1945269 0.1312772 -0.4402698 0.1322036 0.0053671 0.6927982 -0.2453888 0.0484449 -0.4566128 0.2973031 0.3408996 -0.0653858 -0.2156174 -0.1371581 0.1607569 0.2156309 -0.2226409 0.2025662 0.4062062 -0.2059071 0.1456594 0.0570174 0.1817565 -0.0801695 -0.0294694 0.006842 -0.0154314 0.1060903 1.0631037 0.3174895 0.3876602 0.8010321 0.1838927 0.3490227 -0.3803602 -0.0410453 -0.2299847 -0.2578931 0.1404274 0.0633308 0.154556 -0.1988472 -0.0019928 0.1174575 -0.0326915 0.0752516 0.4605963 0.4072102 -0.0287641 0.4076934 0.4288219 -0.6297054 -0.0234273 -0.6203151 0.6618328 0.19705 0.0672695 0.0894998 0.1285154 0.2947011 -0.0419166 0.0673676 -0.0311724 0.2395776 0.108778 -0.0225114 0.0267047 0.0494096 0.0038309 0.0380399 -0.0664938 0.0397383 -0.07135 -0.1030972 -0.016826 0.0460378 -0.0216361 -0.0383938 -0.0000444 0.0844433 -0.0244675 0.0894749 0.0206745 0.1210058 0.0635913 0.0474377 -0.0866704 0.0245871 0.0885484 -0.02336 -0.0096798 0.0503083 0.0396574 -0.0593896 -0.0119187 0.0859508 -0.0064979 -0.069623 0.0429713 0.0218921 0.0293864 0.0852904 0.0019773 0.074199 -0.0379536 0.0364506 0.0094597 0.0666917 0.0071559 -0.018215 -0.0393538 0.0112247 -0.0016414 0.0677359 -0.0714241 -0.0205055 -0.1050242 -0.0138851 0.1281575 -0.0786677 -0.0390977 -0.053784 0.0799901 0.0556285 -0.0412481 0.0156844 -0.0998193 0.0939086 -0.0135318 -0.0666617 -0.0874846 0.1123437 0.0247371 0.0792529 0.0970275 0.1138372 0.1275254 -0.1319264 -0.0625947 -0.0920705 0.0200361 -0.0584502 -0.0678642 -0.0633632 0.0291763 0.1527111 -0.0485769 -0.0388672 -0.0548585 0.1270226 0.0012628 -0.030877 0.0392119 -0.0840237 unknown
polarizability: 153.4311513|15.7151344|152.9479454|6.2349663|-15.1789762|123.4956441 unknown
InChI: InChI=1S/C7H11Cl3NO3P/c1-2-4-11-15(12,13-5-3-8)14-6-7(9)10/h2,6,11H,1,3-5H2
charge 0 multiplicity 1
26 atoms
Cl 2.036205 2.612418 -2.080397
Cl -4.01439 -2.117886 -0.472762
Cl -2.775634 -0.094473 -2.397872
P  0.864497 0.069098 0.786292
O  0.932984 1.790867 0.830002
O  -0.453266 -0.158079 -0.411828
O  0.557886 -0.728365 2.121633
N  2.336804 -0.285496 0.018755
C  2.945785 -1.639331 0.081153
C  0.118907 2.692953 -0.014101
C  1.063705 3.598343 -0.78694
C  2.181613 -2.67378 -0.726862
C  -1.540589 -0.970094 -0.071295
C  1.635743 -3.793472 -0.190679
C  -2.625854 -1.040187 -0.875611
H  2.696467 0.412651 -0.639971
H  3.012666 -1.954261 1.137913
H  3.978397 -1.528901 -0.299314
H  -0.487741 3.310841 0.675255
H  -0.547606 2.119248 -0.680937
H  0.513707 4.366921 -1.351858
H  1.824725 4.050149 -0.135295
H  2.068498 -2.462693 -1.79999
H  -1.470209 -1.543618 0.861135
H  1.086814 -4.51561 -0.805215
H  1.71809 -4.014543 0.880789
