program: Gaussian 09
title: 000213227
version: EM64L-G09RevD.01
frameworkgroup: C1[X(C14H20N6O4)]
method: RPBEPBE
basis: SDD
operation: Freq
keyword: #p
keyword: freq=noraman
keyword: PBEPBE/SDD
title: #p freq=noraman PBEPBE/SDD
converged: YES YES NO NO
title: Mulliken charges:
elementType: O O O O N N N N N N C C C C C C C C C C C C C C H H H H H H H H H H H H H H H H H H H H
charge: -0.256848 -0.437193 -0.463575 -0.448559 -0.193706 -0.033778 -0.226462 -0.063140 -0.092856 -0.097407 -0.242151 -0.115832 -0.150060 -0.078915 -0.321678 0.223712 -0.194949 -0.102982 -0.004044 -0.343593 0.276527 -0.768454 -0.632246 -0.636297 0.259539 0.275683 0.238198 0.261692 0.229505 0.188247 0.401056 0.366648 0.285344 0.369271 0.250910 0.285320 0.249191 0.235615 0.308448 0.235616 0.221673 0.259873 0.241730 0.240929
chargesum: 0.00000
title: Mulliken charges with hydrogens summed into heavy atoms:
elementType: O O O O N N N N N N C C C C C C C C C C C C C C
charge: -0.256848 -0.036137 -0.096927 -0.079288 -0.193706 -0.033778 -0.226462 -0.063140 -0.092856 -0.097407 0.017388 0.159852 0.088139 0.182777 0.096074 0.223712 0.090395 -0.102982 -0.004044 -0.092683 0.276527 0.001671 0.133491 0.106235
polarizability: 3.49295066e+02 1.35024253e+01 1.88672145e+02 -2.08765091e+01 1.73673625e+01 1.56468189e+02
1716.lowfreq: -8.6289 -5.6558 -3.8386 0.0004 0.0006 0.0009 10.6756 19.1927 29.8306
frequency: 9.7961 19.0673 29.6360 42.0827 49.7660 58.2568 76.5230 88.5414 103.0426 121.4060 130.3932 155.2044 184.0379 188.2910 191.0046 209.8973 218.7071 240.0121 256.0182 279.0062 291.8042 305.4237 331.4105 343.1106 358.9072 371.3884 381.6868 430.4178 441.6899 452.2052 472.0241 486.0942 527.2557 543.4796 554.8138 566.1548 574.5371 589.6095 635.9284 645.3595 654.1747 673.4617 724.5959 748.5292 772.3235 790.4071 831.4895 868.6824 874.1173 891.5814 915.3466 922.2809 933.1479 942.0835 972.8352 1002.5281 1009.8080 1022.4807 1035.3273 1036.0989 1053.3391 1063.0217 1086.3222 1090.3954 1093.3190 1112.2784 1126.5571 1134.7279 1138.5058 1157.7161 1173.4004 1185.6395 1223.6459 1231.8381 1238.4819 1252.8705 1266.7990 1269.7746 1291.0799 1293.7962 1300.4946 1316.6555 1319.8638 1333.8053 1340.2709 1364.4211 1378.1048 1384.2549 1395.5906 1397.5363 1401.3803 1404.8737 1424.5832 1443.1656 1447.3487 1454.1093 1461.3132 1480.2886 1483.2376 1486.7711 1492.0057 1514.1360 1530.2210 1564.7825 1579.8189 1627.8992 2558.3933 2953.1807 2959.2053 2967.4577 2976.1344 2997.5316 3019.5183 3034.5280 3048.8101 3058.4989 3069.9077 3080.2392 3082.9721 3115.1972 3129.0774 3139.1986 3159.5828 3246.6408 3497.2451 3526.4970
redmass: 3.2376 5.9455 2.5456 4.5230 2.7325 2.2608 4.5790 4.6065 1.7290 3.0273 1.8938 3.5498 4.6496 1.7896 3.6566 3.2244 4.3756 4.4162 2.9201 5.8867 6.1261 3.7780 4.3236 7.7245 6.1205 1.1571 2.5837 1.6594 1.9915 3.0235 3.2593 4.2642 5.3308 3.7911 5.3622 3.8257 5.7822 5.9021 5.0790 6.4888 9.9495 7.2512 6.5337 5.4864 4.3332 7.2340 1.6146 3.5492 7.6207 2.1289 3.7648 1.4503 4.2477 5.5295 6.2051 2.6995 1.3179 1.7369 1.7125 2.3037 1.4104 3.4684 3.0844 2.8703 1.3740 4.0219 2.1978 3.1771 1.6514 1.6005 1.9546 2.2627 2.7637 1.4286 1.8231 1.1717 1.2259 2.4883 3.7115 1.5034 1.5019 1.6554 4.8267 1.8313 1.2616 1.3024 3.3211 1.2464 1.3595 1.7264 1.6685 1.2570 1.8785 1.4821 1.4438 1.1584 1.0666 1.0700 1.0921 1.1366 1.0513 2.0465 6.5332 1.6718 2.3004 7.7243 1.0792 1.0812 1.0717 1.0411 1.0363 1.0393 1.0849 1.0847 1.0965 1.1007 1.0884 1.0987 1.0963 1.0996 1.0962 1.0965 1.0923 1.0987 1.0671 1.0656
irintensity: 0.2048 1.0475 0.1284 0.8924 2.0963 1.7476 2.6473 5.7048 0.3448 1.9061 2.8230 8.1014 4.1260 3.2154 5.6369 2.7304 10.0307 1.8402 7.3684 7.6647 1.6093 10.2884 8.7107 1.3659 2.2246 47.5116 8.3506 100.4003 85.6731 2.3102 26.4124 3.3658 3.1174 15.1805 5.2481 18.9258 4.8796 16.6398 8.1934 13.1790 29.4202 4.2385 3.4222 29.0749 39.2083 9.0183 10.0114 8.8401 6.3746 1.9346 179.1675 19.0705 68.9718 112.4796 93.0620 184.9630 119.5197 25.5929 19.2275 14.2691 8.3332 1.8176 21.5730 25.1373 17.1551 64.6907 14.4449 25.1603 13.4065 75.8041 113.6326 77.7218 13.8700 28.7974 2.8698 33.7189 7.5448 7.8600 117.2936 23.0814 93.7507 13.2501 105.7945 42.9378 22.9153 2.7140 74.0105 44.2981 37.1886 34.5690 16.3955 79.9367 49.9672 26.4168 143.9616 19.3244 5.3591 4.2192 3.3910 28.2426 16.1329 201.4795 128.4046 317.3813 32.0477 1757.4239 2117.8645 9.1852 110.6322 61.8946 106.3757 20.3191 8.3398 46.3602 34.5131 22.6704 25.1592 12.3013 35.1482 2.1775 12.8463 3.5308 15.1391 2.5276 25.9861 11.7100
temp: 298.150 k
press: 1.00000 atm
elementType: 8 8 8 8 7 7 7 7 7 7 6 6 6 6 6 6 6 6 6 6 6 6 6 6 1 1 1 1 1 1 1 1 1 1 1 1 1 1 1 1 1 1 1 1
symmnumber: 1
zpe: 909195.1 jmol-1
zpe.correction: 0.346294 hartree
zpe.thermalcorrener: 0.369977 hartree
zpe.thermalcorrenthalpy: 0.370921 hartree
zpe.thermalcorrgfe: 0.289959 hartree
zpe.sumelectzpe: -1173.044553 hartree
zpe.sumelectthermal: -1173.020870 hartree
zpe.sumelectthermalent: -1173.019925 hartree
zpe.sumelectthermalfe: -1173.100887 hartree
dipole: -8.1934 0.7263 0.5995
dipole: 8.2474
quadrupole: -110.6246 -151.4357 -142.1590
quadrupole: 7.6856 -17.6758 9.7037
quadrupole: 24.1151 -16.6959 -7.4192 7.6856 -17.6758 9.7037
hfenergy: -1173.3908469 hartree
pointgroup: C01 [X(C14H20N6O4)]
dipole: -3.1936154 -0.0538317 0.5713363 debye
polarizability: 342.2338619|34.3606265|175.0919479|-28.3667001|20.0797962|177.10959 unknown
InChI: InChI=1S/C14H20N6O4/c1-7(19(2)3)18-12-9-13(16-5-15-12)20(6-17-9)14-11(23)10(22)8(4-21)24-14/h5-6,8,10-11,14,21-23H,4H2,1-3H3
charge 0 multiplicity 1
44 atoms
O  3.572054 -0.712737 -1.638319
O  2.906853 2.569514 0.034319
O  4.984289 0.710375 1.410685
O  5.000349 -2.431051 1.422557
N  1.353327 0.128826 -1.256587
N  -0.56605 -1.122773 -1.533372
N  0.536685 1.666817 0.53082
N  -1.772837 1.224372 1.188091
N  -3.10063 -0.451657 0.086688
N  -5.29325 -1.053221 0.513005
C  3.504891 1.389078 -0.509319
C  2.764821 0.515636 -1.572565
C  3.892325 0.30596 0.531204
C  4.345504 -0.87038 -0.347346
C  4.102329 -2.249624 0.274276
C  0.409124 0.637628 -0.359039
C  0.699348 -0.926872 -1.932349
C  -0.771843 -0.143191 -0.542224
C  -1.908551 0.179316 0.270052
C  -0.594922 1.893835 1.264603
C  -4.050061 -0.687033 0.985195
C  -3.833514 -0.662279 2.491802
C  -5.538768 -1.158197 -0.938751
C  -6.427303 -1.407249 1.380014
H  4.437085 1.720533 -1.006977
H  2.780795 0.961035 -2.580312
H  2.99819 0.03829 1.136103
H  5.418821 -0.750963 -0.586012
H  4.350385 -3.053702 -0.437382
H  3.037014 -2.350811 0.573362
H  1.938917 2.351063 0.371798
H  4.769377 1.613126 1.765296
H  1.22089 -1.519291 -2.67982
H  5.101919 -1.566075 1.903667
H  -0.541479 2.709743 1.991587
H  -2.775163 -0.465409 2.7074
H  -4.411202 0.154241 2.961375
H  -4.131778 -1.618049 2.958352
H  -4.566852 -1.174484 -1.454313
H  -6.123766 -0.29227 -1.303505
H  -6.101103 -2.085225 -1.15259
H  -6.278334 -1.046943 2.407252
H  -6.583163 -2.504325 1.408243
H  -7.347924 -0.940176 0.985638
