program: Gaussian 09
title: 000213168
version: EM64L-G09RevD.01
frameworkgroup: C1[X(C13H24Cl2N2O4)]
method: RPBEPBE
basis: SDD
operation: Freq
keyword: #p
keyword: freq=noraman
keyword: PBEPBE/SDD
title: #p freq=noraman PBEPBE/SDD
converged: YES YES NO NO
title: Mulliken charges:
elementType: Cl Cl O O O O N N C C C C C C C C C C C C C H H H H H H H H H H H H H H H H H H H H H H H H
charge: -0.086259 -0.085234 -0.338558 -0.308222 -0.315780 -0.317471 -0.349298 -0.343500 0.020819 -0.089098 -0.091406 -0.333674 -0.746527 -0.720646 -0.726928 0.331888 0.340180 -0.354261 -0.353501 -0.583631 -0.579961 0.265270 0.232308 0.223317 0.254988 0.214527 0.212087 0.226655 0.238568 0.218696 0.235515 0.210720 0.218666 0.219987 0.217647 0.327081 0.247043 0.246424 0.328514 0.247334 0.248026 0.344337 0.257309 0.338304 0.257744
chargesum: 0.00000
title: Mulliken charges with hydrogens summed into heavy atoms:
elementType: Cl Cl O O O O N N C C C C C C C C C C C C C
charge: -0.086259 -0.085234 -0.338558 -0.308222 -0.315780 -0.317471 -0.022218 -0.014985 0.286088 0.143211 0.131912 0.135841 -0.069216 -0.055715 -0.070628 0.331888 0.340180 0.139206 0.141860 0.018015 0.016087
polarizability: 2.08215229e+02 1.11770284e+00 1.95026959e+02 -2.63219340e+00 -1.52235184e+01 1.52545312e+02
1716.lowfreq: -3.0705 0.0016 0.0016 0.0020 5.3267 9.8738 24.3819 31.5001 35.4772
frequency: 24.3321 31.4676 35.4349 40.0409 54.5154 60.7756 63.9068 69.2034 86.6425 105.2494 121.4466 130.0847 132.0077 141.0875 150.6224 186.9123 198.3652 199.7469 213.5207 228.1652 237.4941 259.8366 277.3061 296.6405 306.0891 310.8559 353.3782 364.4305 381.8056 405.1249 457.3471 457.6462 483.3343 513.9898 536.2981 580.0540 592.6197 592.8541 613.4837 613.9969 667.5300 688.5933 694.0984 701.0290 805.8385 828.7416 840.5131 859.7412 870.9744 886.0372 917.5739 921.9592 949.2739 954.3884 962.2471 971.1431 979.7913 982.2950 991.1283 1046.1734 1048.4025 1079.5515 1093.3549 1121.1093 1129.7186 1141.9140 1152.7763 1174.0929 1178.6462 1182.9653 1186.6464 1201.4224 1206.6855 1226.9429 1242.5587 1246.7703 1271.3911 1291.8322 1310.3997 1315.9107 1316.4449 1324.4086 1336.3960 1355.7550 1362.8058 1366.6338 1367.4872 1380.3588 1395.6365 1398.6069 1443.4683 1446.1142 1452.2139 1454.8486 1465.0185 1472.2791 1474.5415 1480.3531 1482.9953 1487.5584 1492.7118 1493.2512 1497.9656 1652.3063 1660.7923 2975.4857 2981.3646 2985.9723 2988.7942 3000.5327 3011.2140 3011.4539 3017.0711 3024.2400 3054.0354 3055.1598 3067.8239 3073.2570 3073.5594 3075.7484 3077.1338 3078.0415 3087.4356 3089.1749 3093.5245 3150.9062 3151.5916 3551.2122 3554.0287
redmass: 7.8460 6.3416 5.7573 9.0564 4.4859 5.9358 6.4705 2.9940 7.5959 3.6884 4.1536 3.6656 6.9242 3.9280 3.5540 4.9906 1.5292 2.2759 1.5598 1.4122 1.9858 2.8700 2.7710 3.0177 3.1897 3.0832 2.5959 2.7375 2.6746 2.5010 2.8331 2.8267 2.9747 3.2126 3.8110 3.2428 4.0165 3.8395 1.4690 1.6006 3.0415 3.6073 9.4261 9.2605 2.3967 2.3972 2.5439 2.3326 2.6823 3.0017 1.4819 1.2405 1.7305 1.6304 2.2898 1.7256 2.2590 2.3666 2.7000 1.8958 1.9535 2.4212 1.9206 4.2305 3.9368 2.3152 2.3990 1.9552 1.3868 1.3876 1.9708 1.7753 1.7121 1.1711 1.3126 1.3753 1.3196 1.3869 1.3000 1.1948 1.1858 1.3190 1.3123 1.3613 1.4119 1.3302 1.3201 1.2070 1.2055 1.2014 1.0959 1.0899 1.0942 1.0926 1.0540 1.1331 1.0570 1.0766 1.0642 1.0675 1.2206 1.3220 1.8390 8.8506 8.8348 1.0363 1.0365 1.0668 1.0509 1.0829 1.0595 1.0596 1.0577 1.0851 1.0597 1.0601 1.0994 1.0999 1.1002 1.0995 1.0991 1.0990 1.1058 1.0988 1.1009 1.1128 1.1128 1.0768 1.0768
irintensity: 0.2998 0.4067 0.1308 0.7671 0.3289 0.6766 0.7675 0.2460 21.1319 0.7964 8.5203 4.6502 4.0693 4.1312 4.6630 3.8332 1.1966 4.4272 4.2602 3.8359 6.0081 4.8250 7.7474 3.5199 2.7280 5.1745 20.2411 9.9228 6.8014 2.9745 3.4982 6.0272 2.3294 6.7685 1.9132 24.9915 31.7588 12.8961 139.3830 53.1434 36.3966 10.1533 101.3203 1.7997 4.6878 15.0167 5.3349 4.4329 23.1252 3.6246 7.3332 3.8646 10.5726 15.8349 57.7964 7.0082 45.3256 48.7158 144.6178 58.6977 63.2887 6.2398 22.4721 23.5115 115.3545 3.4477 7.8357 1.2070 3.8083 53.0562 3.0354 10.7739 229.4243 10.5008 57.6616 183.9446 0.7162 1.7996 4.6906 44.0744 25.8309 8.2428 4.6713 3.2781 2.5876 5.1002 0.4074 13.6123 33.0971 12.0736 30.7498 19.1825 15.1327 7.8893 3.1500 7.3103 0.0849 5.4863 14.0151 17.3651 144.2060 121.6513 387.0546 212.0090 397.0437 27.1692 23.5456 1.0724 38.7720 13.1121 32.1902 46.0063 37.0846 16.6815 21.7775 55.5217 8.8731 8.2959 3.8583 43.6644 7.1435 82.6906 18.6407 32.3640 32.7321 6.2122 7.7279 45.5625 40.2505
temp: 298.150 k
press: 1.00000 atm
elementType: 17 17 8 8 8 8 7 7 6 6 6 6 6 6 6 6 6 6 6 6 6 1 1 1 1 1 1 1 1 1 1 1 1 1 1 1 1 1 1 1 1 1 1 1 1
symmnumber: 1
zpe: 972085.4 jmol-1
zpe.correction: 0.370248 hartree
zpe.thermalcorrener: 0.395193 hartree
zpe.thermalcorrenthalpy: 0.396137 hartree
zpe.thermalcorrgfe: 0.313133 hartree
zpe.sumelectzpe: -1838.662711 hartree
zpe.sumelectthermal: -1838.637766 hartree
zpe.sumelectthermalent: -1838.636822 hartree
zpe.sumelectthermalfe: -1838.719825 hartree
dipole: 0.5698 -0.7145 -0.1271
dipole: 0.9227
quadrupole: -148.8172 -131.9439 -141.5572
quadrupole: -15.1800 10.8271 -0.2477
quadrupole: -8.0444 8.8289 -0.7844 -15.1800 10.8271 -0.2477
hfenergy: -1839.0329587 hartree
pointgroup: C01 [X(C13H24Cl2N2O4)]
dipole: -0.349118 0.0822514 0.0559321 debye
polarizability: 191.3743786|-15.0344205|183.3300879|12.4976388|25.9754352|181.0830342 unknown
InChI: InChI=1S/C13H24Cl2N2O4/c1-9(2)11(21-13(19)17-7-5-15)10(3)8-20-12(18)16-6-4-14/h9-11,16-17H,4-8H2,1-3H3
charge 0 multiplicity 1
45 atoms
Cl 1.181723 -4.000069 -2.7246
Cl 2.807603 2.281981 3.147987
O  -1.624043 -0.822223 -0.157576
O  0.248212 1.993195 -1.116162
O  0.314705 -0.722118 1.196072
O  1.718805 0.176932 -1.483911
N  -0.181962 -2.568497 -0.169211
N  2.233586 1.947202 -0.026957
C  -2.004022 0.585904 0.19635
C  -2.135226 1.358457 -1.143125
C  -3.278507 0.530463 1.073813
C  -0.811102 1.351478 -1.934629
C  -3.267215 0.823502 -2.052133
C  -3.004466 -0.246709 2.383563
C  -3.794693 1.956698 1.390142
C  -0.419409 -1.322715 0.363983
C  1.438393 1.268626 -0.918466
C  1.113435 -3.234978 -0.020492
C  3.4145 1.324664 0.573796
C  1.99279 -3.083035 -1.266628
C  3.142497 0.808051 1.990938
H  -1.170646 1.011944 0.787753
H  -2.35066 2.412787 -0.878953
H  -4.061643 -0.013004 0.508277
H  -0.491832 0.328578 -2.200196
H  -0.910606 1.955713 -2.85377
H  -3.283714 1.36144 -3.018042
H  -4.257484 0.956617 -1.583112
H  -3.128762 -0.252623 -2.257853
H  -2.209936 0.24501 2.97555
H  -2.683497 -1.282414 2.178186
H  -3.918349 -0.291014 3.004097
H  -4.645619 1.902366 2.093044
H  -4.141234 2.490418 0.48724
H  -3.004839 2.566947 1.868959
H  -0.815356 -2.898465 -0.90054
H  0.963877 -4.304342 0.214756
H  1.630127 -2.761981 0.83482
H  1.84091 2.777943 0.42068
H  3.694462 0.467417 -0.065939
H  4.257651 2.038877 0.58187
H  2.078961 -2.033696 -1.584308
H  2.974902 -3.563438 -1.141345
H  2.236824 0.185674 2.035339
H  4.019761 0.303234 2.422735
