program: Gaussian 09
title: 000213163
version: EM64L-G09RevD.01
frameworkgroup: C1[X(C18H20N2O4)]
method: RPBEPBE
basis: SDD
operation: Freq
keyword: #p
keyword: freq=noraman
keyword: PBEPBE/SDD
title: #p freq=noraman PBEPBE/SDD
converged: YES YES NO NO
title: Mulliken charges:
elementType: O O O O N N C C C C C C C C C C C C C C C C C C H H H H H H H H H H H H H H H H H H H H
charge: -0.321041 -0.306756 -0.291844 -0.282239 -0.379562 -0.614610 0.053689 0.424283 0.467796 -0.340466 -0.400574 -0.433136 -0.420624 -0.350722 -0.390096 -0.251200 -0.245933 -0.244176 -0.243119 -0.246856 -0.247885 0.314875 0.311547 -0.607350 0.252934 0.236542 0.260536 0.237431 0.245475 0.236751 0.242100 0.247722 0.223881 0.223509 0.226563 0.225367 0.227472 0.228097 0.327728 0.339573 0.337557 0.270934 0.227547 0.228280
chargesum: 0.00000
title: Mulliken charges with hydrogens summed into heavy atoms:
elementType: O O O O N N C C C C C C C C C C C C C C C C C C
charge: -0.321041 -0.306756 -0.291844 -0.282239 -0.051834 0.062521 0.053689 0.424283 0.467796 0.149010 0.097392 -0.187661 -0.183873 -0.108622 -0.142374 -0.027319 -0.022425 -0.017613 -0.017752 -0.019384 -0.019788 0.314875 0.311547 0.119412
polarizability: 2.35330426e+02 -1.08044831e+01 2.12292150e+02 2.55955033e+01 -2.16805535e+01 1.91926842e+02
1716.lowfreq: -8.1999 0.0004 0.0006 0.0008 1.5046 5.5181 10.8765 26.2042 31.5925
frequency: 10.5805 25.9155 31.5288 39.3843 42.0183 47.0763 51.7286 67.7447 69.8192 89.7907 105.9222 130.1279 157.0278 182.4365 189.6908 201.9548 237.8704 247.3093 264.8357 284.3375 297.5662 314.9189 347.0281 398.9975 401.8483 428.3945 474.3621 489.5160 494.0891 501.7166 511.6473 547.5686 576.7100 598.9066 616.7925 617.3141 621.1500 623.8428 673.3522 697.9970 698.9747 702.2826 704.2014 723.8264 765.5991 782.2947 793.3828 849.0217 849.6964 852.1295 881.4518 908.4452 920.6802 929.8849 975.5110 976.1212 977.8213 991.1284 991.9182 994.3179 994.7811 1001.1577 1023.1992 1028.5136 1039.5649 1058.8096 1076.9579 1083.8422 1094.5714 1110.1258 1126.1878 1145.5150 1161.1476 1173.5030 1174.0433 1195.1996 1196.3333 1200.6243 1203.1175 1206.5887 1252.2441 1277.7442 1299.4200 1326.2933 1328.7869 1352.7649 1366.4905 1378.0402 1380.4547 1429.1256 1435.1185 1436.1368 1459.8352 1471.3773 1478.6381 1483.7582 1485.2639 1489.3305 1518.3726 1587.7298 1589.9206 1592.6119 1611.3078 1615.1082 1676.2808 1693.1189 2977.7413 3012.9583 3025.5426 3054.3765 3086.9916 3100.3981 3111.4007 3118.7893 3122.1104 3125.5738 3128.1754 3139.0996 3141.1988 3151.5350 3151.8188 3164.0409 3164.6492 3559.6557 3576.5040 3718.0842
redmass: 5.6240 3.9804 4.5894 4.8195 4.8696 5.2413 4.3823 4.7164 4.7265 1.2098 4.3854 5.6745 4.1524 4.9768 5.5878 5.2740 4.8364 5.0441 5.1732 2.9341 4.5083 4.4757 2.4687 2.8016 2.8053 4.0528 3.3745 1.3729 2.4234 4.3453 1.0661 3.4597 1.1140 4.6787 6.4066 6.3719 4.8367 4.8690 5.8677 9.6848 11.3414 1.7531 1.7002 2.9087 2.0849 2.7477 2.8398 2.3910 1.3849 1.2554 3.8142 2.1101 1.4116 1.8707 1.4806 1.4386 3.7616 5.0800 6.0125 1.3321 1.3617 3.9504 4.0175 2.8680 2.2486 1.9902 1.8849 1.8045 1.8825 4.7793 1.2814 1.7385 2.9049 1.0583 1.0659 1.4969 2.2535 1.1847 2.1767 1.7198 1.2745 1.2670 2.6055 1.3357 1.3573 1.4312 1.6966 4.6303 5.8860 1.1639 2.2626 2.2416 1.3001 1.1486 1.2122 1.0444 1.9402 1.7883 1.4520 1.3508 3.9305 5.8620 6.0147 5.9733 8.9998 7.5066 1.0354 1.0572 1.0567 1.1026 1.1068 1.1081 1.0980 1.0852 1.0845 1.0873 1.0878 1.0927 1.0924 1.0949 1.0953 1.1008 1.1013 1.0446 1.0772 1.1057
irintensity: 1.1146 0.3801 1.5557 4.0385 0.0765 2.4110 3.6296 6.6491 2.1339 0.5020 1.6097 4.3471 0.9527 1.3672 2.2990 1.7163 1.9388 5.6174 4.6866 13.0054 9.5231 6.8563 14.3889 0.1506 0.0410 2.9347 6.8200 236.5255 47.1843 13.8277 19.8424 15.5331 128.3130 13.5561 0.1696 0.0988 5.2020 6.4558 14.8004 31.5771 33.6883 32.0807 67.9156 30.2186 24.4669 25.6741 25.0309 2.3926 0.1258 0.5426 19.5900 1.8338 2.7019 0.2261 9.4011 4.7834 111.6042 0.2217 4.9208 0.2991 1.6039 92.4862 84.1918 15.7639 34.7071 13.9063 11.7389 10.8001 16.3731 309.4292 0.0790 12.4387 22.0723 0.6459 0.8614 10.1926 0.9650 0.5328 289.2857 0.7220 10.3810 3.0685 330.2350 2.7906 1.9392 11.4280 75.7239 12.8871 6.2607 27.9829 11.3998 6.3056 173.7718 16.7089 21.4619 14.5485 14.3017 15.7961 174.1100 98.2283 12.7827 1.1614 9.1075 2.4615 224.1356 305.4611 87.8163 24.1188 25.9525 37.2721 15.9279 12.5991 3.7141 4.2868 2.6552 0.5283 1.3345 21.3930 26.1836 39.0388 35.4620 22.2933 14.4394 61.8775 27.1857 49.8015
temp: 298.150 k
press: 1.00000 atm
elementType: 8 8 8 8 7 7 6 6 6 6 6 6 6 6 6 6 6 6 6 6 6 6 6 6 1 1 1 1 1 1 1 1 1 1 1 1 1 1 1 1 1 1 1 1
symmnumber: 1
zpe: 920641.3 jmol-1
zpe.correction: 0.350654 hartree
zpe.thermalcorrener: 0.374132 hartree
zpe.thermalcorrenthalpy: 0.375076 hartree
zpe.thermalcorrgfe: 0.293563 hartree
zpe.sumelectzpe: -1106.586049 hartree
zpe.sumelectthermal: -1106.562570 hartree
zpe.sumelectthermalent: -1106.561626 hartree
zpe.sumelectthermalfe: -1106.643139 hartree
dipole: -1.5357 -0.3738 -0.2303
dipole: 1.5972
quadrupole: -121.4106 -125.5718 -144.1070
quadrupole: -8.2430 17.7034 1.1949
quadrupole: 8.9526 4.7913 -13.7439 -8.2430 17.7034 1.1949
hfenergy: -1106.9367026 hartree
pointgroup: C01 [X(C18H20N2O4)]
dipole: 0.6261656 0.0459325 -0.0261748 debye
polarizability: 234.6581391|-13.6426664|208.9632145|-19.7355708|27.3770091|195.9280648 unknown
InChI: InChI=1S/C18H20N2O4/c1-20-17(22)24-13-18(12-23-16(19)21,14-8-4-2-5-9-14)15-10-6-3-7-11-15/h2-11,20H,12-13,19H2,1H3
charge 0 multiplicity 1
44 atoms
O  2.239702 0.232333 0.367496
O  -0.384547 2.312142 -0.759802
O  3.164117 1.286063 2.269198
O  -2.133433 2.488634 -2.345968
N  4.488666 0.506671 0.483395
N  -1.71382 4.150503 -0.742417
C  -0.139559 -0.052637 -0.083855
C  -1.570911 0.007492 0.507352
C  0.176588 -1.489964 -0.571383
C  0.903785 0.350392 0.990635
C  -0.044983 0.963081 -1.259222
C  -1.856919 0.534785 1.791649
C  0.747472 -1.771816 -1.837478
C  -2.654502 -0.461638 -0.281266
C  -0.083455 -2.578278 0.303177
C  -3.185156 0.581935 2.276996
C  1.046009 -3.100866 -2.219107
C  -3.979648 -0.409533 0.195545
C  0.221333 -3.903437 -0.069483
C  -4.252647 0.111929 1.482029
C  0.788235 -4.172803 -1.3373
C  3.305088 0.730933 1.14873
C  -1.487906 2.948193 -1.372801
C  5.780362 0.922059 1.033716
H  0.759438 1.393981 1.317501
H  0.858537 -0.318651 1.868631
H  -0.734015 0.705661 -2.082155
H  0.990661 1.032062 -1.628511
H  -1.055241 0.914233 2.433034
H  0.968922 -0.965187 -2.54296
H  -2.457223 -0.876796 -1.276421
H  -0.543901 -2.385173 1.279575
H  -3.381913 0.988439 3.275729
H  1.480932 -3.295901 -3.206201
H  -4.798057 -0.773234 -0.435594
H  0.010862 -4.72551 0.623995
H  -5.281586 0.150926 1.856892
H  1.020795 -5.201984 -1.633017
H  4.437074 0.014792 -0.408832
H  -2.476295 4.736056 -1.069782
H  -1.149753 4.426471 0.057476
H  5.592995 1.407521 2.004655
H  6.288277 1.645206 0.368723
H  6.446921 0.054516 1.195128
