program: Gaussian 09
title: 000213109
version: EM64L-G09RevD.01
frameworkgroup: C1[X(C9H16N2O)]
method: RPBEPBE
basis: SDD
operation: Freq
keyword: #p
keyword: freq=noraman
keyword: PBEPBE/SDD
title: #p freq=noraman PBEPBE/SDD
converged: YES YES NO NO
title: Mulliken charges:
elementType: O N N C C C C C C C C C H H H H H H H H H H H H H H H H
charge: -0.319989 -0.107384 -0.618089 0.389208 -0.458075 -0.488346 -0.376432 -0.377770 -0.570650 -0.398568 -0.398441 0.181461 0.214685 0.220701 0.198473 0.226144 0.197319 0.194414 0.190339 0.209203 0.223092 0.222944 0.193770 0.198372 0.190677 0.199718 0.330304 0.332922
chargesum: 0.00000
title: Mulliken charges with hydrogens summed into heavy atoms:
elementType: O N N C C C C C C C C C
charge: -0.319989 -0.107384 0.045137 0.389208 -0.022689 -0.063730 0.015300 0.021772 -0.124614 -0.006426 -0.008047 0.181461
polarizability: 1.31288084e+02 -1.53003796e+00 9.69061543e+01 -4.90349933e+00 5.91462588e+00 9.63365537e+01
1716.lowfreq: -19.9095 -0.0007 -0.0006 -0.0003 4.8349 19.7320 60.1247 67.5740 137.8643
frequency: 59.5658 67.4755 137.8060 202.8206 224.6699 253.2509 267.5028 303.4200 338.8606 347.8157 363.3438 408.6301 438.0236 450.7385 472.1484 496.5634 613.0916 645.9375 672.9801 735.3295 769.4834 789.5673 833.8993 844.8417 864.5740 874.1972 914.4692 927.2171 954.0440 959.5380 985.9184 1011.1862 1059.5942 1073.4735 1090.3169 1122.2576 1135.6054 1147.8512 1176.0339 1198.7670 1207.8469 1222.7671 1268.3833 1279.1059 1286.1749 1300.4629 1334.8146 1335.6307 1339.8422 1355.7250 1358.2953 1362.9743 1369.1447 1443.4258 1462.6734 1465.5673 1466.2082 1473.3476 1477.2208 1488.7319 1586.1288 1686.3501 2954.2003 2960.6702 2964.5932 2967.8250 2973.0401 2979.0457 2985.9398 3011.9739 3020.3642 3028.5448 3029.3056 3035.5749 3037.1597 3044.4065 3583.2249 3735.8327
redmass: 3.8048 3.5386 3.0270 3.0425 2.4970 2.8175 2.6397 2.2505 2.5491 1.2575 1.8494 2.8186 1.1526 2.1072 2.2274 1.6809 2.8474 10.4113 4.8927 4.0490 3.0307 1.9070 1.9737 1.5491 2.4421 6.7155 2.2212 3.0704 2.0539 2.0109 1.9962 1.6792 1.9722 2.0549 1.9143 2.4370 1.9891 1.4096 1.5084 1.2188 1.5357 1.3993 1.3876 1.2093 1.2505 1.5888 1.5462 1.4017 1.4692 1.4729 1.4193 1.5817 2.2645 1.0843 1.0828 1.0872 1.0871 1.0855 1.0878 1.0822 1.1978 7.3196 1.0605 1.0640 1.0643 1.0634 1.0632 1.0634 1.0627 1.0953 1.0998 1.0996 1.1005 1.0993 1.0984 1.1006 1.0444 1.1058
irintensity: 0.0902 0.1353 1.0366 3.1829 0.7631 0.9203 2.3610 2.1461 30.2924 188.5206 57.6428 2.9461 65.8348 1.4821 0.3465 1.4859 0.0703 13.9877 1.1767 8.7485 9.3038 1.3816 14.4582 2.6315 5.3894 96.9336 0.6999 69.7890 2.1395 11.6168 8.6902 1.4751 10.1942 1.8492 1.4106 6.3499 0.6128 16.2214 5.2982 2.8398 2.3150 4.7640 52.5299 2.5542 23.7283 12.2622 19.7902 0.9025 9.0041 3.8656 3.0410 41.1953 58.3617 7.6501 8.5110 7.6879 4.5735 14.0902 6.1117 12.4026 53.4429 469.0845 30.2755 33.2124 7.0180 12.9582 82.8561 25.9608 9.7886 79.2840 54.5277 55.0146 11.7607 66.4889 36.7162 54.8550 83.4841 49.7304
temp: 298.150 k
press: 1.00000 atm
elementType: 8 7 7 6 6 6 6 6 6 6 6 6 1 1 1 1 1 1 1 1 1 1 1 1 1 1 1 1
symmnumber: 1
zpe: 640692.0 jmol-1
zpe.correction: 0.244027 hartree
zpe.thermalcorrener: 0.255543 hartree
zpe.thermalcorrenthalpy: 0.256487 hartree
zpe.thermalcorrgfe: 0.207165 hartree
zpe.sumelectzpe: -536.326623 hartree
zpe.sumelectthermal: -536.315106 hartree
zpe.sumelectthermalent: -536.314162 hartree
zpe.sumelectthermalfe: -536.363485 hartree
dipole: -1.0425 -0.8880 -1.2480
dipole: 1.8528
quadrupole: -67.7858 -74.4845 -71.5727
quadrupole: -5.5532 -8.4917 -0.2172
quadrupole: 3.4952 -3.2035 -0.2916 -5.5532 -8.4917 -0.2172
hfenergy: -536.5706496 hartree
pointgroup: C01 [X(C9H16N2O1)]
dipole: -0.4244401 0.3200014 0.4987888 debye
polarizability: 131.0608514|1.9045009|96.465722|5.3903381|6.0442163|97.0042185 unknown
InChI: InChI=1S/C9H16N2O/c10-8-11-7-9(12-8)5-3-1-2-4-6-9/h1-7,10H2
charge 0 multiplicity 1
28 atoms
O  1.248828 0.69298 0.649409
N  2.530412 -0.657771 -0.782706
N  3.5521 0.544584 1.036904
C  0.218499 -0.006371 -0.241124
C  -0.474941 -1.039295 0.676112
C  -0.692552 1.078741 -0.847122
C  -1.834759 -1.581691 0.164509
C  -1.875082 1.574643 0.020805
C  1.139656 -0.682931 -1.324174
C  -3.042402 -0.707047 0.588353
C  -3.138854 0.682106 -0.086473
C  2.495109 0.141405 0.255616
H  -0.630296 -0.567485 1.665438
H  0.237357 -1.871677 0.837304
H  -1.100633 0.6878 -1.802171
H  -0.031712 1.92383 -1.119268
H  -1.983522 -2.59718 0.580675
H  -1.818135 -1.704101 -0.938385
H  -2.147354 2.594045 -0.31706
H  -1.558433 1.674705 1.077832
H  0.822468 -1.723783 -1.520025
H  1.102033 -0.130802 -2.285001
H  -2.998585 -0.573015 1.6893
H  -3.980564 -1.260398 0.379593
H  -3.37565 0.547766 -1.163161
H  -4.001299 1.221586 0.354785
H  3.386436 1.10537 1.866061
H  4.487876 0.237986 0.791771
