program: Gaussian 09
title: 000213138
version: EM64L-G09RevD.01
frameworkgroup: C1[X(C18H18N2O2S)]
method: RPBEPBE
basis: SDD
operation: Freq
keyword: #p
keyword: freq=noraman
keyword: PBEPBE/SDD
title: #p freq=noraman PBEPBE/SDD
converged: YES YES NO NO
title: Mulliken charges:
elementType: S O O N N C C C C C C C C C C C C C C C C C C H H H H H H H H H H H H H H H H H H
charge: 0.240703 -0.245236 -0.253835 -0.113795 0.018297 -0.336406 -0.344472 -0.300302 -0.310852 -0.362593 0.277346 0.073774 -0.331717 -0.343928 -0.207169 -0.172182 -0.267775 -0.196998 -0.266326 -0.211701 -0.207368 -0.219435 -0.233061 0.237680 0.229840 0.242253 0.227934 0.226379 0.202647 0.201098 0.229749 0.224170 0.286196 0.281015 0.257712 0.245944 0.257523 0.267698 0.232287 0.232682 0.232223
chargesum: 0.00000
title: Mulliken charges with hydrogens summed into heavy atoms:
elementType: S O O N N C C C C C C C C C C C C C C C C C C
charge: 0.240703 -0.245236 -0.253835 -0.113795 0.018297 0.131114 0.125715 0.128724 0.119995 -0.138422 0.277346 0.073774 -0.045520 -0.062913 -0.207169 0.085530 -0.021832 -0.196998 -0.008803 0.055997 0.024918 0.013247 -0.000838
polarizability: 3.49360306e+02 1.55785536e+01 2.92763454e+02 1.91139119e+01 2.56476841e+00 1.45707276e+02
1716.lowfreq: -6.9459 -2.6117 -0.0009 -0.0004 0.0009 1.7374 12.0376 18.4129 27.1699
frequency: 11.0322 17.9551 27.1248 35.5698 42.3250 59.0711 62.8085 91.1631 138.6949 161.8005 179.9895 198.9353 211.6476 246.6295 256.1230 264.6091 278.9363 325.3616 348.8772 371.0149 380.3917 401.9176 406.0939 416.0824 458.1702 461.1752 475.0895 491.7545 515.2390 553.6252 610.1238 614.8216 627.5631 664.0201 676.7555 677.6827 695.4563 746.7832 750.5819 755.5859 780.1026 808.7148 834.0135 847.7921 854.7014 859.0009 898.9810 916.4809 922.6421 977.3837 985.0159 992.6279 994.4073 996.6170 999.4781 1003.1053 1011.9175 1015.4467 1052.8752 1060.2283 1072.8811 1074.7427 1078.8868 1085.6813 1099.6877 1114.1676 1147.9200 1172.1568 1176.9412 1183.5251 1192.5766 1193.7031 1258.2241 1276.9120 1292.1029 1297.2540 1303.2011 1304.7913 1332.7799 1343.9224 1355.9703 1358.4132 1366.1456 1374.5242 1377.7988 1407.0936 1426.2984 1449.4558 1451.1164 1455.5396 1459.6689 1460.1705 1474.3638 1499.2831 1536.8959 1567.4413 1586.6737 1587.3143 1598.6620 2951.0484 2954.0977 2960.8844 2965.6874 3052.2408 3061.1158 3082.5156 3089.8717 3094.7217 3129.1349 3137.3107 3138.4313 3146.2237 3151.3449 3159.4658 3161.5117 3170.3586 3180.2062
redmass: 6.2472 3.9093 5.4685 3.4376 4.3135 4.4462 6.1628 8.2345 5.5158 4.8831 6.3623 4.6130 2.1474 4.4836 3.2073 6.3029 5.2242 5.2348 6.7040 3.6892 2.3451 2.9709 2.9324 6.6692 5.6735 3.1354 3.4915 5.2493 5.0533 4.0770 6.2140 2.8300 6.7904 4.4490 4.2470 6.4789 2.2366 3.4010 2.7938 2.0830 4.5843 3.8394 1.6098 1.2558 1.2684 1.5000 1.6509 2.3183 1.3667 1.3918 6.2040 1.9759 1.6471 1.3183 1.3706 3.7245 2.4227 3.3503 1.9084 3.6384 1.7118 2.7278 3.9775 2.5965 2.1962 1.3648 2.2713 1.0532 2.7324 1.1157 1.1590 1.0756 1.4981 1.3047 1.7355 1.2708 1.3250 1.7597 1.2713 1.2979 2.9486 1.5096 2.3026 7.7931 1.4871 4.2878 2.1131 1.0789 1.0844 1.1004 2.0695 1.1019 2.3714 8.0443 5.5136 7.1147 6.3022 6.0228 6.1824 1.0691 1.0698 1.0647 1.0656 1.0919 1.0895 1.0937 1.0965 1.0979 1.0849 1.0885 1.0885 1.0897 1.0928 1.0967 1.0956 1.1016 1.0947
irintensity: 0.2488 0.7656 0.3465 0.0091 0.6205 3.1898 0.1166 1.4014 2.3619 5.6708 0.2712 0.7699 5.2949 11.5251 21.1173 1.3762 5.0785 1.8298 1.5912 22.0413 7.7614 1.1478 1.5011 0.2544 9.8254 4.2220 18.1037 17.6981 4.5979 13.5241 0.3635 18.5854 1.6593 32.9679 14.6504 7.5477 48.5917 15.4686 9.6079 51.1452 77.1810 16.3360 8.8034 2.3008 6.8489 52.9524 23.4431 3.9725 2.2078 0.0408 10.9521 67.5072 50.4648 0.2098 2.7198 24.7112 17.6672 17.7354 15.3732 47.0068 7.9266 14.5096 47.4063 69.0842 22.0111 7.4742 176.3587 0.1031 19.4130 2.9141 26.9904 3.1962 5.3696 4.7364 70.4478 0.4827 12.9728 349.7611 26.5645 12.3807 4.8681 9.6368 47.8824 1.2442 19.6811 20.0437 10.3826 5.1278 11.6245 54.6031 36.8993 12.2413 9.0122 210.7499 282.8704 67.3159 15.2634 34.1951 126.0784 47.1143 35.7931 20.5171 108.8863 20.5692 47.1150 16.4121 28.7070 32.1813 0.5547 4.0206 6.0851 3.4210 15.7206 20.0429 6.5429 18.2361 12.1256
temp: 298.150 k
press: 1.00000 atm
elementType: 16 8 8 7 7 6 6 6 6 6 6 6 6 6 6 6 6 6 6 6 6 6 6 1 1 1 1 1 1 1 1 1 1 1 1 1 1 1 1 1 1
symmnumber: 1
zpe: 842776.2 jmol-1
zpe.correction: 0.320996 hartree
zpe.thermalcorrener: 0.341868 hartree
zpe.thermalcorrenthalpy: 0.342812 hartree
zpe.thermalcorrgfe: 0.266752 hartree
zpe.sumelectzpe: -1353.010347 hartree
zpe.sumelectthermal: -1352.989476 hartree
zpe.sumelectthermalent: -1352.988532 hartree
zpe.sumelectthermalfe: -1353.064592 hartree
dipole: 1.4512 -5.5074 -0.3271
dipole: 5.7047
quadrupole: -129.4942 -148.0597 -139.0729
quadrupole: 6.1272 -2.0476 -0.1041
quadrupole: 9.3814 -9.1841 -0.1973 6.1272 -2.0476 -0.1041
hfenergy: -1353.3313437 hartree
pointgroup: C01 [X(C18H18N2O2S1)]
dipole: -0.6527086 -2.0460009 0.652105 debye
polarizability: 336.5131473|-0.8140444|278.6191928|53.7210713|-43.3305376|172.6986966 unknown
InChI: InChI=1S/C18H18N2O2S/c21-18(14-19-20-10-12-22-13-11-20)15-6-8-17(9-7-15)23-16-4-2-1-3-5-16/h1-9,14H,10-13H2
charge 0 multiplicity 1
41 atoms
S  4.192703 1.430136 0.778186
O  -6.018068 -2.431755 -0.28427
O  -1.798171 3.437845 -1.820164
N  -3.836893 -0.582861 -0.528077
N  -2.7160 0.185525 -0.630906
C  -3.579856 -2.018562 -0.281135
C  -5.150906 -0.247225 -1.13235
C  -4.766929 -2.652627 0.460985
C  -6.276779 -0.990124 -0.381816
C  -2.752144 1.405882 -1.153171
C  -0.207424 1.992894 -0.729682
C  -1.582282 2.310491 -1.246336
C  0.150772 0.800481 -0.041546
C  0.801044 2.974288 -0.948981
C  2.459551 1.578532 0.176036
C  1.469399 0.597041 0.413271
C  2.120256 2.773615 -0.50931
C  4.417404 -0.392672 0.960049
C  4.810299 -0.901567 2.219209
C  4.288077 -1.255059 -0.154872
C  5.077954 -2.283929 2.362182
C  4.539358 -2.63664 0.000081
C  4.939306 -3.15339 1.256229
H  -2.651675 -2.09501 0.309031
H  -3.426526 -2.545767 -1.246957
H  -5.153642 -0.517604 -2.210099
H  -5.332096 0.838938 -1.047737
H  -4.646722 -3.745498 0.528845
H  -4.856747 -2.222851 1.481848
H  -6.389253 -0.559031 0.636358
H  -7.228343 -0.891855 -0.928616
H  -3.656691 1.867442 -1.582441
H  -0.612674 0.041236 0.138845
H  0.51886 3.889416 -1.479874
H  1.724284 -0.321334 0.951806
H  2.88636 3.532525 -0.702382
H  4.899563 -0.225265 3.075458
H  3.995255 -0.848766 -1.128545
H  5.386231 -2.676792 3.337271
H  4.436244 -3.304502 -0.862277
H  5.143302 -4.223802 1.369751
