program: Gaussian 09
title: 000213151
version: EM64L-G09RevD.01
frameworkgroup: C1[X(C22H24N2O)]
method: RPBEPBE
basis: SDD
operation: Freq
keyword: #p
keyword: freq=noraman
keyword: PBEPBE/SDD
title: #p freq=noraman PBEPBE/SDD
converged: YES YES NO NO
title: Mulliken charges:
elementType: O N N C C C C C C C C C C C C C C C C C C C C C C H H H H H H H H H H H H H H H H H H H H H H H H
charge: -0.278343 -0.087952 -0.273464 -0.374182 -0.359491 -0.355433 -0.407498 -0.407588 -0.399490 0.414298 0.433370 0.307297 0.127764 -0.441715 -0.453824 0.039606 -0.339686 -0.373208 -0.485617 -0.258159 -0.230912 -0.255092 -0.243041 0.028416 -0.600468 0.199021 0.172965 0.236645 0.240208 0.166600 0.194373 0.198738 0.218511 0.192691 0.215410 0.187536 0.233261 0.238035 0.234901 0.271840 0.277981 0.213428 0.229639 0.228840 0.228803 0.232078 0.235266 0.216927 0.210715
chargesum: 0.00000
title: Mulliken charges with hydrogens summed into heavy atoms:
elementType: O N N C C C C C C C C C C C C C C C C C C C C C C
charge: -0.278343 -0.087952 -0.273464 -0.175161 0.050118 0.051374 -0.014387 0.003614 0.003456 0.414298 0.433370 0.307297 0.127764 -0.208454 -0.215789 0.039606 -0.104785 -0.101368 0.005793 -0.028520 -0.002072 -0.026289 -0.010962 0.263682 -0.172825
polarizability: 2.95416849e+02 -8.11846533e+00 2.13704638e+02 -4.83575437e+00 6.42833249e+00 2.39207443e+02
1716.lowfreq: -9.4851 -6.9287 0.0003 0.0006 0.0007 8.6454 35.1090 46.6017 50.9417
frequency: 34.7428 46.4644 50.6720 62.0795 64.9608 72.5476 77.6138 103.9079 123.0773 133.8306 177.0412 218.6236 229.6572 240.3502 260.1407 272.2132 302.8602 304.5993 314.2251 328.2131 388.1709 389.4106 401.0194 417.9638 434.3169 442.1392 450.3622 467.0692 496.1558 506.0878 546.3077 572.2972 598.4847 619.7484 635.7595 647.4600 654.8624 684.2166 700.7433 741.5698 755.2878 764.8262 783.2767 799.1983 805.1105 824.9320 840.1107 858.3981 863.2699 866.5742 877.3519 892.2925 906.1075 929.5709 942.3563 944.5480 960.0889 961.3651 981.1461 983.7967 986.6768 994.6963 1002.0310 1009.1346 1040.3866 1047.7276 1054.6734 1075.3613 1091.1820 1094.3542 1120.5744 1124.1512 1133.0190 1143.4574 1151.2358 1153.3559 1174.1871 1176.4100 1196.9592 1208.9717 1215.1611 1225.4426 1247.3368 1258.8219 1261.7671 1268.5019 1269.6516 1280.6832 1288.6722 1319.6615 1320.8515 1331.9928 1336.5785 1343.8255 1352.6016 1353.1244 1355.9998 1378.9901 1384.2036 1389.9957 1427.5534 1437.6056 1443.2857 1449.6743 1461.4452 1465.8606 1466.9506 1476.4202 1479.3251 1484.6468 1487.3149 1540.6965 1585.2035 1591.2462 1609.3504 1611.1542 1658.7981 2813.4540 2819.2790 2834.7638 2967.2420 2981.0451 2989.6360 2989.8660 3034.3373 3040.8163 3041.7387 3044.4875 3052.3447 3056.5845 3086.8147 3112.2073 3118.8931 3121.1896 3136.1977 3137.3648 3153.5116 3156.8024 3169.1149 3171.6897 3197.0446
redmass: 4.3597 4.6201 2.9401 4.1811 4.4028 3.1314 4.4743 2.8314 4.5147 3.3430 3.3918 2.6052 3.3970 4.1606 2.9562 3.8878 4.4465 2.4601 4.0819 4.3711 1.9875 3.8798 3.8227 4.2926 4.2077 3.0955 2.9747 3.1126 3.0947 2.6432 3.3911 2.3000 2.5546 5.3928 5.4705 5.1585 3.1779 5.2218 3.5722 2.8570 2.2840 1.5961 1.9852 3.1551 1.4963 3.4874 2.7979 2.1136 1.6043 2.1303 2.9615 1.6549 1.5344 2.3299 1.3650 1.3965 1.3347 1.4165 1.3625 2.1892 2.7030 1.3435 1.5458 2.9367 2.4356 2.2096 2.1450 1.5840 2.5303 2.2151 1.9763 2.4846 1.9357 2.2836 1.6091 1.7701 1.0654 1.1239 2.1553 1.7676 1.8561 1.6164 2.0933 1.3299 1.6107 1.4550 1.2309 1.3226 1.2755 1.7379 1.3891 1.3113 1.7606 1.4593 1.5089 1.7800 1.4866 3.1825 3.8775 2.0966 1.2024 2.4171 2.4756 1.0902 1.0867 1.0797 1.0999 2.3446 1.0989 1.5166 1.7139 7.8969 6.9911 7.3278 6.3973 6.3439 4.6929 1.0718 1.0752 1.0759 1.0629 1.0609 1.0587 1.0612 1.0959 1.1008 1.0907 1.0993 1.0916 1.0993 1.0607 1.0935 1.0877 1.0870 1.0882 1.0894 1.0942 1.0942 1.0994 1.0986 1.1137
irintensity: 0.9161 0.2483 0.4953 0.5031 0.2718 1.0791 0.5208 0.1660 1.2248 1.4438 0.3542 0.3382 0.4748 0.1323 1.4751 0.4713 4.9556 2.4606 3.6405 1.5470 1.0433 1.3371 13.0736 4.9691 2.7474 0.2584 1.3497 2.2440 6.1373 5.8593 0.7919 1.9502 6.0437 1.9822 9.3690 5.0188 14.7115 28.1776 28.0877 13.2570 16.6998 63.2380 20.7157 25.9128 0.1098 0.7026 6.7526 7.7804 2.4634 4.8473 0.8159 0.8688 13.6227 1.3107 55.1401 15.9475 1.7683 5.4998 1.3911 25.7014 34.8830 0.8896 10.9856 19.5841 13.5778 8.8933 4.4296 7.8907 25.3838 9.8092 25.1130 14.0504 23.0413 8.9008 3.9931 16.8357 1.5519 0.5950 10.1862 2.4010 8.8320 39.5092 20.1738 1.6324 42.7363 19.5695 20.2436 18.3430 4.6246 24.5171 19.3170 5.9106 96.2543 4.5721 2.0527 55.0891 2.7772 1.0107 6.9048 1.8351 6.4350 6.7802 42.8331 5.3879 14.0381 1.1979 13.1455 48.9868 1.0974 55.8085 7.3603 198.6900 4.6803 25.8865 9.0090 5.7484 16.3788 38.3798 48.9999 173.1576 43.1688 30.3847 56.3005 28.1997 73.5617 21.1343 49.6019 16.6705 27.0064 64.1316 11.4741 5.6546 4.9149 4.6645 6.3358 11.4420 17.5109 27.7414 25.7833 19.1944 21.4961
temp: 298.150 k
press: 1.00000 atm
elementType: 8 7 7 6 6 6 6 6 6 6 6 6 6 6 6 6 6 6 6 6 6 6 6 6 6 1 1 1 1 1 1 1 1 1 1 1 1 1 1 1 1 1 1 1 1 1 1 1 1
symmnumber: 1
zpe: 1069562.8 jmol-1
zpe.correction: 0.407375 hartree
zpe.thermalcorrener: 0.428920 hartree
zpe.thermalcorrenthalpy: 0.429864 hartree
zpe.thermalcorrgfe: 0.356919 hartree
zpe.sumelectzpe: -1035.648038 hartree
zpe.sumelectthermal: -1035.626493 hartree
zpe.sumelectthermalent: -1035.625549 hartree
zpe.sumelectthermalfe: -1035.698494 hartree
dipole: 0.5615 -0.4669 -3.4440
dipole: 3.5206
quadrupole: -134.2062 -141.8826 -149.8356
quadrupole: -1.8026 4.6805 -4.2570
quadrupole: 7.7686 0.0922 -7.8608 -1.8026 4.6805 -4.2570
hfenergy: -1036.0554131 hartree
pointgroup: C01 [X(C22H24N2O1)]
dipole: -0.3301445 -0.0764937 -1.3429971 debye
polarizability: 296.6926885|0.0876625|211.659047|1.5346519|-1.081551|239.9771942 unknown
InChI: InChI=1S/C22H24N2O/c1-2-14-24-20-13-7-6-12-19(20)21(23-15-8-3-9-16-23)17-10-4-5-11-18(17)22(24)25/h2,4-7,10-13,21H,1,3,8-9,14-16H2
charge 0 multiplicity 1
49 atoms
O  0.742044 0.574019 2.790277
N  0.355891 -1.593552 -0.373963
N  -0.827118 0.881924 1.096373
C  0.620258 -0.401012 -1.236592
C  -0.781035 -2.402526 -0.891212
C  1.57581 -2.4309 -0.202411
C  -1.105641 -3.580555 0.048642
C  1.314733 -3.604483 0.762662
C  0.136085 -4.471892 0.270205
C  -0.598752 0.511165 -1.382998
C  1.755429 0.454983 -0.68731
C  -1.23372 1.124947 -0.259722
C  1.651439 1.010782 0.615513
C  -1.072597 0.807279 -2.683011
C  2.904955 0.72265 -1.46633
C  0.501638 0.766515 1.55343
C  -2.345265 1.981757 -0.486006
C  2.720713 1.78876 1.129936
C  -1.887025 0.762016 2.145144
C  -2.168184 1.667385 -2.901517
C  3.950398 1.526752 -0.963972
C  -2.808828 2.253387 -1.787445
C  3.859128 2.05868 0.343867
C  -2.912688 -0.303795 1.83312
C  -4.253115 -0.137293 1.9460
H  0.911056 -0.735138 -2.266985
H  -0.544759 -2.806403 -1.912956
H  -1.662618 -1.746436 -0.99651
H  2.387741 -1.796173 0.191567
H  1.917885 -2.835893 -1.193397
H  -1.941835 -4.166562 -0.378981
H  -1.442254 -3.180917 1.025561
H  1.083652 -3.193147 1.76408
H  2.237067 -4.209536 0.854255
H  -0.086467 -5.27668 0.995935
H  0.412651 -4.963822 -0.685744
H  -0.571705 0.336233 -3.537525
H  2.980387 0.28808 -2.470245
H  -2.846583 2.451262 0.364626
H  2.641592 2.166421 2.154066
H  -1.333676 0.505293 3.067945
H  -2.375098 1.739428 2.320151
H  -2.518783 1.871263 -3.91851
H  4.833961 1.726405 -1.580313
H  -3.662902 2.924827 -1.927823
H  4.670557 2.673491 0.74789
H  -2.499745 -1.280399 1.54328
H  -4.9511 -0.961438 1.764204
H  -4.69278 0.827347 2.231548
