program: Gaussian 09
title: 000213121
version: EM64L-G09RevD.01
frameworkgroup: C1[X(C18H20N4O2S2)]
method: RPBEPBE
basis: SDD
operation: Freq
keyword: #p
keyword: freq=noraman
keyword: PBEPBE/SDD
title: #p freq=noraman PBEPBE/SDD
converged: NO YES NO NO
title: Mulliken charges:
elementType: S S O O N N N N C C C C C C C C C C C C C C C C C C H H H H H H H H H H H H H H H H H H H H
charge: 0.201469 0.201469 -0.291311 -0.291311 -0.503345 -0.503344 -0.437059 -0.437060 0.497960 0.497960 -0.412572 -0.412572 -0.150178 -0.150178 -0.365549 -0.365550 -0.268728 -0.268728 -0.200542 -0.200542 0.297130 0.297130 -0.139848 -0.139848 -0.870105 -0.870105 0.223176 0.223176 0.309419 0.309419 0.242891 0.242891 0.287622 0.287622 0.227383 0.227383 0.295315 0.295315 0.267038 0.267038 0.266453 0.261692 0.261688 0.266453 0.261696 0.261685
chargesum: 0.00000
title: Mulliken charges with hydrogens summed into heavy atoms:
elementType: S S O O N N N N C C C C C C C C C C C C C C C C C C
charge: 0.201469 0.201469 -0.291311 -0.291311 -0.215723 -0.215722 -0.141744 -0.141744 0.497960 0.497960 -0.189396 -0.189396 -0.150178 -0.150178 -0.056130 -0.056131 -0.025837 -0.025837 0.026840 0.026841 0.297130 0.297130 0.127190 0.127190 -0.080271 -0.080271
polarizability: 5.86559301e+02 4.09580119e+00 2.97955236e+02 -3.71245218e-03 -1.39482526e-02 1.10613234e+02
1716.lowfreq: -3.1264 -0.0023 -0.0018 -0.0013 1.9570 7.7140 10.5454 14.8569 16.9087
frequency: 10.5454 14.8569 16.9087 28.7256 36.6156 42.2093 50.2318 58.7378 72.8021 79.4879 112.8124 118.7489 125.5360 167.7732 168.1929 171.1022 171.8915 188.1240 225.1760 227.0095 243.3976 246.9201 247.4018 278.6060 287.6960 297.4373 316.4442 345.5825 353.7392 408.7164 426.6368 428.4635 429.9576 434.4718 445.9553 472.6920 494.5027 567.9768 571.2873 606.7487 609.8704 614.2596 621.7899 657.6258 666.0778 680.5039 684.4867 685.8840 686.8913 688.6814 688.7333 766.1571 776.1348 793.8209 793.8794 834.4107 843.9328 843.9984 860.7935 870.7856 908.6562 908.6969 948.9302 966.1661 966.1705 977.2784 977.8774 983.2292 987.2083 987.2499 990.2193 995.6737 1024.8953 1081.8840 1082.3126 1101.8500 1102.0396 1153.9201 1166.1433 1184.6779 1184.6852 1215.0080 1247.2416 1263.4722 1265.9752 1273.8293 1276.6707 1309.8676 1310.8438 1348.5602 1348.7058 1378.6121 1380.7649 1399.3352 1400.5529 1452.8126 1455.8898 1455.8916 1459.9813 1461.4079 1474.8173 1476.3332 1501.0112 1517.1812 1523.8721 1593.4593 1593.5049 1603.5899 1604.3280 1642.9232 1647.2440 1717.6527 3002.2631 3002.2697 3116.1212 3116.1280 3119.6028 3119.6068 3131.3093 3131.3181 3134.5864 3134.5894 3153.9573 3156.7256 3156.7453 3158.5940 3202.5295 3202.5450 3523.5714 3523.6444 3540.6331 3541.0594
redmass: 5.1960 5.3430 7.4433 4.7506 4.1257 4.2706 5.8382 6.2910 7.9658 5.1212 4.8910 6.7386 4.2657 2.0298 4.9710 3.1518 3.1453 4.8993 2.4325 2.4264 5.7290 1.3016 1.3445 5.4683 2.3780 6.6534 6.6107 6.4020 5.9363 6.9254 6.6856 6.1465 1.9740 2.8588 1.8063 1.8954 5.5771 2.6469 3.0610 1.4802 1.4237 6.1171 6.6624 6.9557 6.6827 7.5927 7.5525 7.2495 6.3218 2.4144 2.5663 5.9162 7.4315 1.3467 1.3455 1.8111 1.6518 1.6496 5.8312 5.4024 1.3733 1.3734 1.0802 1.1801 1.1801 5.9849 5.2497 2.4720 1.3105 1.3102 1.3617 2.0257 6.0596 2.0954 2.0515 1.6078 1.6128 3.1084 2.8560 1.0908 1.0914 2.2337 2.0039 1.6314 2.5889 1.1600 1.4997 1.4666 1.5155 1.1682 1.1667 3.4521 4.7067 3.3882 3.2380 1.9485 1.0522 1.0522 1.2909 1.2247 1.7483 1.9158 1.9399 2.1152 2.3483 5.1437 5.0856 6.1220 6.1083 4.1907 4.9490 5.3041 1.0294 1.0294 1.1061 1.1061 1.0904 1.0904 1.1010 1.1010 1.0871 1.0871 1.0998 1.0965 1.0965 1.0847 1.0948 1.0948 1.0763 1.0763 1.0766 1.0768
irintensity: 1.2356 2.5810 1.5658 0.0000 1.3828 0.0000 0.0000 0.0000 29.0557 2.6552 6.9990 0.0000 0.0000 0.0000 0.0000 1.5998 0.0000 26.9956 1.8205 0.0000 0.0000 1.9108 0.0000 2.3380 9.2207 0.0000 9.4679 0.0000 2.6854 27.5047 0.0000 1.7817 0.0000 12.2505 0.0000 1.1668 0.0000 0.0000 58.7036 0.0000 238.7165 0.0000 9.0850 0.0000 10.7807 0.0000 15.5562 0.0000 85.7321 0.0000 12.1542 2.8822 0.0000 0.0033 107.7361 0.0000 0.0081 74.4263 0.0000 58.0588 0.0003 12.1788 136.4393 0.9497 19.1901 4.9282 0.0000 35.0703 0.0038 10.7090 0.0000 9.5176 0.0000 43.7972 0.0000 68.8274 0.0000 0.0000 552.7490 0.0262 18.9625 1018.3978 0.0000 121.4791 0.0000 0.0000 721.3112 0.0000 120.4331 0.0004 33.9021 0.0000 412.0056 0.0000 32.6164 0.0000 0.5381 30.0690 493.5953 0.0000 477.1198 0.0000 1684.9507 562.0908 0.0000 174.5504 0.0116 456.8180 0.0000 289.6398 0.0000 0.0000 5.2385 41.4445 9.3072 32.2949 11.3032 13.5662 24.1281 0.2857 13.8408 1.1900 0.0000 37.2257 0.0083 89.2089 18.8154 0.0795 18.9400 0.0000 24.0611 0.0000
temp: 298.150 k
press: 1.00000 atm
elementType: 16 16 8 8 7 7 7 7 6 6 6 6 6 6 6 6 6 6 6 6 6 6 6 6 6 6 1 1 1 1 1 1 1 1 1 1 1 1 1 1 1 1 1 1 1 1
symmnumber: 1
zpe: 927762.3 jmol-1
zpe.correction: 0.353366 hartree
zpe.thermalcorrener: 0.380514 hartree
zpe.thermalcorrenthalpy: 0.381458 hartree
zpe.thermalcorrgfe: 0.290305 hartree
zpe.sumelectzpe: -1861.632640 hartree
zpe.sumelectthermal: -1861.605492 hartree
zpe.sumelectthermalent: -1861.604548 hartree
zpe.sumelectthermalfe: -1861.695701 hartree
dipole: 0.0000 0.0000 -0.0001
dipole: 0.0001
quadrupole: -188.2019 -150.4613 -179.1881
quadrupole: -41.0333 0.0041 -0.0011
quadrupole: -15.5848 22.1558 -6.5710 -41.0333 0.0041 -0.0011
hfenergy: -1861.9860055 hartree
pointgroup: C01 [X(C18H20N4O2S2)]
dipole: 0.0000023 -0.0000016 -0.0000356 debye
polarizability: 586.6118948|-1.2625239|297.9026423|0.0039707|0.0138769|110.6132342 unknown
InChI: InChI=1S/C18H20N4O2S2/c1-25-15-7-3-5-13(11-15)21-17(23)19-9-10-20-18(24)22-14-6-4-8-16(12-14)26-2/h3-12,19-22H,1-2H3
charge 0 multiplicity 1
46 atoms
S  -9.375621 1.152896 0.190412
S  9.375802 -1.152874 0.190374
O  -2.896118 -1.948244 0.189761
O  2.896297 1.948272 0.190339
N  -4.207401 0.02756 0.190148
N  4.207584 -0.02753 0.190063
N  -1.869308 0.153608 0.190177
N  1.869492 -0.153582 0.190171
C  -5.530147 -0.498636 0.1901
C  5.53033 0.498664 0.190167
C  -6.591763 0.449456 0.190236
C  6.591945 -0.449429 0.190233
C  -7.933068 0.016198 0.190214
C  7.933251 -0.016174 0.190299
C  -5.816166 -1.887476 0.18994
C  5.816352 1.887504 0.190179
C  -8.228387 -1.372107 0.190048
C  8.228572 1.372131 0.190312
C  -7.167337 -2.299305 0.189916
C  7.167524 2.299331 0.190258
C  -2.999266 -0.685864 0.189957
C  2.999448 0.685892 0.19021
C  -0.563677 -0.381974 0.190111
C  0.56386 0.381999 0.190219
C  -8.571023 2.84482 0.190324
C  8.571201 -2.844797 0.190163
H  -6.351438 1.519725 0.190361
H  6.351618 -1.519698 0.190252
H  -4.997806 -2.608071 0.189822
H  4.997994 2.608101 0.190144
H  -9.268129 -1.716075 0.190017
H  9.268315 1.716097 0.19036
H  -4.150907 1.048234 0.190337
H  4.15109 -1.048204 0.18991
H  -7.395468 -3.370943 0.189786
H  7.395657 3.370968 0.190269
H  -1.975014 1.169877 0.190361
H  1.975198 -1.169851 0.190063
H  -0.556878 -1.47662 0.189955
H  0.55706 1.476645 0.19035
H  -9.404268 3.564442 0.19025
H  -7.963681 2.991583 -0.717159
H  -7.963733 2.991718 1.097821
H  9.404445 -3.56442 0.190251
H  7.964026 -2.991576 -0.717429
H  7.963744 -2.991676 1.09755
