program: Gaussian 09
title: 000213140
version: EM64L-G09RevD.01
frameworkgroup: C1[X(C21H26N2O)]
method: RPBEPBE
basis: SDD
operation: Freq
keyword: #p
keyword: freq=noraman
keyword: PBEPBE/SDD
title: #p freq=noraman PBEPBE/SDD
converged: YES YES NO NO
title: Mulliken charges:
elementType: O N N C C C C C C C C C C C C C C C C C C C C C H H H H H H H H H H H H H H H H H H H H H H H H H H
charge: -0.311330 -0.100389 -0.069708 -0.169732 -0.356792 -0.366491 -0.380284 -0.394740 -0.647080 0.401209 -0.285176 0.424611 0.158497 -0.654189 0.199892 -0.706771 0.448229 -0.376631 -0.424673 -0.361358 -0.383393 -0.265201 -0.819011 -0.232003 0.206761 0.228239 0.180061 0.183838 0.225696 0.201519 0.186786 0.195061 0.201497 0.232491 0.247173 0.202896 0.173997 0.242094 0.227224 0.216768 0.211426 0.254936 0.227252 0.233524 0.254911 0.226163 0.228811 0.225403 0.230071 0.227918
chargesum: 0.00000
title: Mulliken charges with hydrogens summed into heavy atoms:
elementType: O N N C C C C C C C C C C C C C C C C C C C C C
charge: -0.311330 -0.100389 -0.069708 0.037029 0.051508 0.043043 0.008021 0.001819 -0.167417 0.401209 0.091717 0.424611 0.158497 -0.412096 0.199892 -0.051353 0.448229 -0.121695 -0.197421 -0.127834 -0.128482 -0.039039 -0.134726 -0.004085
polarizability: 2.49555479e+02 5.44276423e+01 2.80174637e+02 1.57485585e+01 -1.10409581e+01 2.04862351e+02
1716.lowfreq: -7.1593 -6.2836 -0.0004 0.0002 0.0009 8.4571 25.5734 28.7802 31.0241
frequency: 25.5146 28.6773 30.8955 44.0705 48.3610 70.1089 92.5883 106.3295 137.3971 162.7917 182.9763 187.6462 224.7739 236.0588 250.7345 252.9487 271.3603 283.9429 311.5857 322.9394 337.0023 339.6248 387.1738 404.6660 413.0380 439.2268 458.5819 471.1248 484.8729 496.2864 521.3921 541.1114 556.2296 587.8789 612.7191 637.6311 661.1407 688.4848 713.0363 736.8153 745.6015 751.4395 761.0257 772.7868 799.9120 819.5038 830.8451 848.1160 857.7211 869.0305 897.8672 908.7505 932.8850 940.1495 942.6385 959.2883 960.2645 975.3991 988.4180 1016.2299 1023.5715 1042.9198 1047.1397 1048.0727 1055.8502 1080.8625 1086.1402 1094.5468 1112.6040 1120.1698 1127.3451 1145.3843 1149.6275 1157.8669 1166.5745 1171.9637 1189.1367 1199.8357 1205.0124 1212.5505 1239.6164 1245.8380 1254.7649 1262.0763 1264.6769 1271.5992 1292.1241 1297.1184 1306.5750 1330.2687 1338.0567 1345.5534 1358.8329 1362.6074 1380.5518 1383.1251 1385.6781 1388.4017 1391.5149 1401.2376 1417.2514 1433.4870 1451.5123 1452.3208 1459.4437 1464.5088 1468.8057 1469.3574 1471.1027 1475.1812 1478.2400 1484.1058 1488.7945 1491.0012 1584.1840 1587.8229 1613.2142 1624.8817 2822.1030 2834.7876 2844.1074 2855.0584 2859.1030 2871.4859 2974.8284 2985.2414 2991.4867 3007.2218 3023.7977 3039.3050 3047.0795 3051.2185 3058.6504 3063.0737 3078.3251 3082.9063 3089.8334 3110.2463 3111.8168 3126.5906 3135.3951 3154.8456 3164.0775 3170.3730
redmass: 3.8213 2.1556 1.3687 2.9479 4.0028 3.6529 2.4967 3.2365 3.3522 3.5664 4.2663 2.1249 3.7430 2.4491 2.0484 1.8924 3.5776 3.4669 4.5283 2.3304 2.7677 4.5477 2.4498 2.9473 3.0557 3.1214 3.2003 3.4631 3.4786 4.0194 3.7211 3.2283 5.3536 3.7005 2.6115 6.0542 4.6554 4.6951 3.5386 4.3132 2.9024 2.5399 1.5349 4.3350 1.1557 4.0199 1.3833 1.5307 1.5475 3.3328 1.4386 3.0765 2.2903 1.6801 1.9743 1.7114 1.6429 1.3123 1.6511 2.0013 2.3029 2.1867 1.5421 2.1124 1.8943 2.2408 2.5697 2.0235 2.3701 1.7867 2.3030 2.7162 2.8119 1.4381 1.1639 1.8373 1.3684 1.3881 2.0187 1.7267 2.1597 1.5277 2.6356 1.5997 1.4295 1.3889 1.2752 1.3921 1.2956 1.4323 1.3184 1.3612 1.5340 1.4452 5.9508 1.4535 1.3905 4.5621 1.4405 1.2427 2.9060 2.2159 1.0815 1.0837 1.0943 1.1228 1.0570 1.4369 1.0469 1.0750 1.2638 1.7384 2.0982 1.0698 6.7840 6.9331 6.8487 6.7404 1.0810 1.0713 1.0710 1.0702 1.0706 1.0685 1.0374 1.0355 1.0617 1.0876 1.0892 1.0999 1.0888 1.0977 1.0868 1.0873 1.0984 1.0983 1.1004 1.0882 1.0906 1.0893 1.0877 1.0939 1.0952 1.0996
irintensity: 0.0871 0.2409 0.8314 0.1168 0.0348 0.4625 0.9400 0.3818 0.2898 1.4999 0.7676 0.4453 1.6847 0.5817 0.3902 1.8388 0.3373 0.7262 0.9843 4.7523 3.1045 1.4769 0.2584 1.3034 3.3945 0.0846 5.2010 0.2112 5.9123 1.5130 0.6821 2.0872 2.1928 1.1142 1.1965 1.6711 3.6746 1.9242 1.5206 0.9101 9.3850 37.1098 66.0965 5.4944 2.9488 11.5603 47.5023 0.1992 2.0805 19.3282 7.1010 4.0976 2.4077 6.5765 5.5904 6.4378 13.9524 0.6520 10.2006 12.7458 28.9509 3.9298 11.3801 1.5270 1.3665 0.9313 13.2145 12.0561 38.2597 25.6972 10.1919 42.9186 46.3085 8.0123 0.5892 7.3285 1.8913 19.0573 13.7840 19.4834 171.9262 42.6045 183.4061 3.9926 6.9069 23.4517 12.4289 11.1642 16.5046 8.3699 22.6603 8.8303 10.0307 5.2921 3.2485 10.2282 10.3096 10.3478 7.1943 8.5537 20.8552 72.5048 2.6086 4.8354 21.7172 8.5125 10.0674 36.5473 12.2577 7.8604 45.2745 60.3042 143.2182 9.3155 49.9782 8.3070 5.9072 1.0233 61.9588 72.7707 74.7972 7.0625 6.0950 287.7712 52.0924 29.7236 27.7916 19.4607 52.9660 22.7982 38.8661 21.5850 37.2429 16.8728 56.6616 17.7916 36.3897 10.0263 16.2456 19.9336 10.2451 24.3230 7.7497 18.1409
temp: 298.150 k
press: 1.00000 atm
elementType: 8 7 7 6 6 6 6 6 6 6 6 6 6 6 6 6 6 6 6 6 6 6 6 6 1 1 1 1 1 1 1 1 1 1 1 1 1 1 1 1 1 1 1 1 1 1 1 1 1 1
symmnumber: 1
zpe: 1110990.9 jmol-1
zpe.correction: 0.423154 hartree
zpe.thermalcorrener: 0.445135 hartree
zpe.thermalcorrenthalpy: 0.446080 hartree
zpe.thermalcorrgfe: 0.370822 hartree
zpe.sumelectzpe: -998.757321 hartree
zpe.sumelectthermal: -998.735340 hartree
zpe.sumelectthermalent: -998.734396 hartree
zpe.sumelectthermalfe: -998.809653 hartree
dipole: 0.0382 -0.8590 0.9414
dipole: 1.2750
quadrupole: -136.6612 -137.8790 -137.0975
quadrupole: 9.9906 0.1550 1.2503
quadrupole: 0.5514 -0.6664 0.1150 9.9906 0.1550 1.2503
hfenergy: -999.1804753 hartree
pointgroup: C01 [X(C21H26N2O1)]
dipole: -0.1784518 0.276129 0.3788786 debye
polarizability: 211.1370344|17.1873071|318.624448|-18.458939|6.3455909|204.8309841 unknown
InChI: InChI=1S/C21H26N2O/c1-3-22-10-12-23(13-11-22)19-15-17-6-4-5-7-20(17)24-21-9-8-16(2)14-18(19)21/h4-9,14,19H,3,10-13,15H2,1-2H3
charge 0 multiplicity 1
50 atoms
O  1.854957 -0.208959 -1.216648
N  -0.950849 -0.020907 0.587869
N  -3.798269 -0.381827 0.041669
C  0.246943 0.452052 1.345476
C  -1.806356 1.100927 0.117521
C  -1.774327 -0.988814 1.356815
C  -2.974878 0.579116 -0.73247
C  -2.942178 -1.503349 0.500225
C  1.152984 -0.734213 1.795924
C  1.067564 1.443748 0.532914
C  -4.988119 -0.869885 -0.701988
C  1.391518 -1.782181 0.721816
C  1.809956 1.066282 -0.61482
C  1.139594 2.798972 0.946225
C  1.681397 -1.484629 -0.636128
C  -6.034894 0.228389 -0.96489
C  1.885944 3.781072 0.255832
C  2.553515 2.032889 -1.334878
C  1.305181 -3.154983 1.076948
C  2.591793 3.370985 -0.906333
C  1.870091 -2.51886 -1.585335
C  1.500689 -4.195723 0.146189
C  1.931084 5.223101 0.730839
C  1.781075 -3.869438 -1.201323
H  -0.07263 0.983501 2.28121
H  -1.193621 1.788368 -0.489917
H  -2.222969 1.679499 0.981686
H  -2.183923 -0.521459 2.289074
H  -1.150545 -1.852325 1.642563
H  -3.602357 1.436461 -1.033597
H  -2.563235 0.106104 -1.661142
H  -2.518601 -2.078749 -0.36231
H  -3.558098 -2.196064 1.104707
H  0.70829 -1.233482 2.675954
H  2.108339 -0.295566 2.143336
H  -5.451844 -1.664645 -0.085653
H  -4.695094 -1.347094 -1.674541
H  0.572615 3.089936 1.840327
H  -6.308821 0.727339 -0.018567
H  -5.667187 0.997206 -1.66786
H  -6.946886 -0.213506 -1.406727
H  3.099768 1.702999 -2.223911
H  1.078818 -3.401442 2.122517
H  3.178885 4.102858 -1.474206
H  2.089693 -2.232144 -2.618236
H  1.430821 -5.241213 0.46418
H  1.569539 5.91766 -0.050832
H  1.305511 5.373282 1.627525
H  2.962545 5.531775 0.986482
H  1.931373 -4.658267 -1.946311
