program: Gaussian 09
title: 000213122
version: EM64L-G09RevD.01
frameworkgroup: C1[X(C16H10Cl6N4O2)]
method: RPBEPBE
basis: SDD
operation: Freq
keyword: #p
keyword: freq=noraman
keyword: PBEPBE/SDD
title: #p freq=noraman PBEPBE/SDD
converged: YES YES NO YES
title: Mulliken charges:
elementType: Cl Cl Cl Cl Cl Cl O O N N N N C C C C C C C C C C C C C C C C H H H H H H H H H H
charge: -0.050634 -0.050634 0.003009 0.003010 0.003650 0.003650 -0.290019 -0.290020 -0.492222 -0.492222 -0.429915 -0.429915 0.679096 0.679095 -0.416912 -0.416912 -0.257589 -0.257589 -0.089353 -0.089353 -0.210870 -0.210869 -0.123840 -0.123841 0.305911 0.305911 -0.134680 -0.134680 0.341865 0.341866 0.301614 0.301614 0.283744 0.283744 0.306398 0.306398 0.270747 0.270748
chargesum: 0.00000
title: Mulliken charges with hydrogens summed into heavy atoms:
elementType: Cl Cl Cl Cl Cl Cl O O N N N N C C C C C C C C C C C C C C C C
charge: -0.050634 -0.050634 0.003009 0.003010 0.003650 0.003650 -0.290019 -0.290020 -0.190608 -0.190608 -0.123518 -0.123517 0.679096 0.679095 -0.416912 -0.416912 0.084276 0.084277 -0.089353 -0.089353 0.072874 0.072875 -0.123840 -0.123841 0.305911 0.305911 0.136068 0.136068
polarizability: 6.24590411e+02 3.83314043e+01 3.00252510e+02 8.95697178e-04 3.37104663e-04 9.61256385e+01
1716.lowfreq: -2.7048 -0.8886 0.0019 0.0022 0.0032 4.5788 6.8947 14.2647 14.8385
frequency: 6.8947 14.2647 14.8385 27.5676 51.4297 52.5681 53.7510 75.9130 80.2782 97.4804 100.3627 113.1582 125.8001 155.7218 165.7345 173.2833 178.3360 179.4461 187.9278 192.6618 214.4043 231.5319 232.1979 259.4149 285.8436 290.4473 303.0236 312.6945 314.1546 352.0386 353.2390 401.9398 403.2420 439.8316 441.3729 453.0187 479.3732 488.0922 490.4234 492.8903 518.4702 535.6644 570.4432 606.4709 607.4993 643.8844 645.2424 651.4233 657.0924 690.4998 691.8189 702.9848 703.3990 714.9337 735.6383 767.9806 772.7934 839.0830 850.3892 850.3932 899.6445 903.0858 916.8663 916.9349 950.2225 983.4492 1009.0766 1023.9341 1034.4889 1114.8943 1115.3903 1160.2769 1174.4759 1219.2068 1233.5783 1235.5633 1250.5304 1258.2560 1260.2675 1278.2238 1280.5048 1356.9582 1359.2581 1378.9051 1378.9389 1439.3051 1442.2721 1461.0520 1494.9494 1507.6975 1510.2824 1568.7479 1568.9662 1602.0128 1603.1007 1642.1992 1649.3235 1716.8174 3157.9618 3162.2421 3182.9083 3182.9300 3184.8332 3184.8525 3481.3328 3481.5475 3538.7323 3539.1366
redmass: 19.4512 12.3731 13.9687 12.5742 15.0985 8.6742 15.1748 8.2096 8.1685 18.3820 9.7429 10.7321 7.7537 6.7892 5.4030 2.0051 25.8443 28.7113 19.2575 10.9964 18.4712 5.3104 5.2212 13.2968 9.2775 14.8863 2.4201 25.8115 24.9354 7.3762 8.8596 10.7223 7.4903 2.9874 3.2069 10.3999 6.9436 6.0030 7.9183 1.3816 1.6965 8.5487 5.7631 5.5488 5.9646 1.3420 1.3523 7.6376 7.4527 10.3066 9.6158 3.5161 3.5134 8.5962 8.6009 5.5720 7.4353 1.8284 1.4069 1.4068 7.8169 7.5136 1.3783 1.3779 1.0810 7.2993 7.7998 5.4666 4.5363 1.8869 1.9188 3.4398 3.1784 2.1725 1.2445 1.2366 2.5930 3.7159 3.4448 1.2148 1.3944 4.3375 5.1066 9.2288 9.1318 2.2668 2.7669 2.2460 2.6498 3.5831 2.1622 4.4884 4.4405 7.7251 7.5367 4.0459 4.7586 5.2389 1.1002 1.0847 1.0925 1.0925 1.0934 1.0934 1.0762 1.0762 1.0772 1.0773
irintensity: 0.7250 0.0613 0.9954 0.0000 0.0000 0.0000 0.0004 23.2713 0.0000 0.0000 5.6693 17.7883 0.0000 1.0994 0.0000 0.0000 0.0000 0.5272 3.7771 0.0000 0.0000 0.6321 0.0000 2.3213 15.7637 0.0000 6.8984 0.0000 2.4312 0.0000 0.5201 0.0000 40.0017 0.0000 34.8263 11.5583 0.0000 5.4088 0.0000 0.0000 18.8849 70.5274 0.0000 0.0000 30.9062 0.0000 206.8662 0.0000 61.4497 0.0000 57.5007 0.0000 58.3410 0.0000 21.0334 5.9324 0.0000 0.0000 3.2556 22.3999 0.0000 36.8442 0.0000 71.8334 146.6232 8.1755 0.0000 165.6064 0.0000 95.4995 0.0001 0.0000 508.1630 803.1791 0.0000 28.8664 0.0000 33.1346 0.0000 0.0000 1007.6816 0.0000 432.1679 0.0235 34.6205 0.0000 325.6820 0.0000 3131.1376 0.0000 350.5252 162.5325 0.0011 293.2965 0.0000 342.8742 0.0000 0.0000 0.0000 95.1959 54.7625 0.1505 25.2846 0.1319 107.7339 0.0035 37.2065 0.0001
temp: 298.150 k
press: 1.00000 atm
elementType: 17 17 17 17 17 17 8 8 7 7 7 7 6 6 6 6 6 6 6 6 6 6 6 6 6 6 6 6 1 1 1 1 1 1 1 1 1 1
symmnumber: 1
zpe: 628271.7 jmol-1
zpe.correction: 0.239296 hartree
zpe.thermalcorrener: 0.267219 hartree
zpe.thermalcorrenthalpy: 0.268163 hartree
zpe.thermalcorrgfe: 0.174612 hartree
zpe.sumelectzpe: -3743.554581 hartree
zpe.sumelectthermal: -3743.526658 hartree
zpe.sumelectthermalent: -3743.525714 hartree
zpe.sumelectthermalfe: -3743.619265 hartree
dipole: 0.0000 0.0000 0.0003
dipole: 0.0003
quadrupole: -253.8745 -200.9874 -207.8908
quadrupole: -36.9312 -0.0002 0.0001
quadrupole: -32.9569 19.9302 13.0268 -36.9312 -0.0002 0.0001
hfenergy: -3743.7938772 hartree
pointgroup: C01 [X(C16H10Cl6N4O2)]
dipole: -0.000007 0.0000018 -0.0001295 debye
polarizability: 623.4622529|-42.8243866|301.3806676|0.0008909|-0.0003495|96.1256385 unknown
InChI: InChI=1S/C16H10Cl6N4O2/c17-7-3-11(21)13(5-9(7)19)25-15(27)23-1-2-24-16(28)26-14-6-10(20)8(18)4-12(14)22/h1-6,23-26H
charge 0 multiplicity 1
38 atoms
Cl -5.864755 -3.223245 0.000218
Cl 5.86455 3.223298 0.000224
Cl -7.970873 2.846202 0.000413
Cl 7.970658 -2.846151 0.000434
Cl -10.108767 0.338437 0.0005
Cl 10.108556 -0.33839 0.00054
O  -3.185873 1.422719 0.000138
O  3.185664 -1.422663 0.000144
N  -4.138456 -0.746675 0.000159
N  4.138248 0.746731 0.000146
N  -1.814306 -0.470866 0.000099
N  1.814092 0.47092 0.000069
C  -5.511788 -0.431747 0.000234
C  5.511579 0.431801 0.000234
C  -6.462875 -1.490853 0.000272
C  6.462668 1.490906 0.000282
C  -6.0144 0.897346 0.000278
C  6.014189 -0.897293 0.000283
C  -7.40074 1.130642 0.000357
C  7.400528 -1.130591 0.000374
C  -7.84544 -1.264686 0.000352
C  7.845232 1.264736 0.000375
C  -8.322869 0.062598 0.000395
C  8.322659 -0.062549 0.000421
C  -3.064911 0.162436 0.000102
C  3.0647 -0.162379 0.00007
C  -0.620029 0.281379 0.000088
C  0.619816 -0.281326 0.000087
H  -5.303594 1.725906 0.000246
H  5.303382 -1.725852 0.000244
H  -3.935596 -1.751447 0.000139
H  3.935389 1.751503 0.000138
H  -8.546539 -2.102468 0.000381
H  8.546332 2.102518 0.00041
H  -1.747047 -1.490662 0.000121
H  1.746831 1.490716 0.000063
H  -0.79843 1.361181 0.000077
H  0.798217 -1.361128 0.000094
